Taxon,"Gene ID","Gene Symbol",Transcript,"Clone ID","Legacy Clone Name","Target Seq",Vector,"Match Position","Match Region","Match %","SDR Match %","Intrinsic Score","Adjusted Score","Matches Other Gene in Same Taxon?","Orig. Target Gene ID","Orig. Target Gene Symbol","Forward Oligo Sequence","Reverse Oligo Sequence",Addgene
mouse,105243390,Gm39325,XR_870690.1,TRCN0000040833,NM_153762.2-2585s1c1,GCTGGGAATGTTCTATTCCAT,pLKO.1,1225,3UTR,100,100,.3,.21,N,213211,Rnf26,CCGGGCTGGGAATGTTCTATTCCATCTCGAGATGGAATAGAACATTCCCAGCTTTTTG,AATTCAAAAAGCTGGGAATGTTCTATTCCATCTCGAGATGGAATAGAACATTCCCAGC,n/a
mouse,105243390,Gm39325,XR_870690.1,TRCN0000434437,NM_032299.3-1493s21c1,TATAGTCATCTCTGCACAATT,pLKO_005,1529,3UTR,86,90,,,N,84259,DCUN1D5,CCGGTATAGTCATCTCTGCACAATTCTCGAGAATTGTGCAGAGATGACTATATTTTTG,AATTCAAAAATATAGTCATCTCTGCACAATTCTCGAGAATTGTGCAGAGATGACTATA,n/a
mouse,105243390,Gm39325,XR_870690.1,TRCN0000192882,NM_026325.1-384s1c1,GCACCAATTCTTTCTGCAATT,pLKO.1,488,3UTR,85,89,,,Y,67706,Tmem179b,CCGGGCACCAATTCTTTCTGCAATTCTCGAGAATTGCAGAAAGAATTGGTGCTTTTTG,AATTCAAAAAGCACCAATTCTTTCTGCAATTCTCGAGAATTGCAGAAAGAATTGGTGC,n/a
mouse,105243390,Gm39325,XR_870690.1,TRCN0000164623,NM_173544.2-647s1c1,CTGAATCCTTGGGAGACCATA,pLKO.1,1554,3UTR,85,89,,,Y,199786,NIBAN3,CCGGCTGAATCCTTGGGAGACCATACTCGAGTATGGTCTCCCAAGGATTCAGTTTTTG,AATTCAAAAACTGAATCCTTGGGAGACCATACTCGAGTATGGTCTCCCAAGGATTCAG,n/a
mouse,105243390,Gm39325,XR_870690.1,TRCN0000076068,NM_007981.2-2617s1c1,CCCTTTAAGAACAACTGTCCA,pLKO.1,139,3UTR,80,89,,,Y,14081,Acsl1,CCGGCCCTTTAAGAACAACTGTCCACTCGAGTGGACAGTTGTTCTTAAAGGGTTTTTG,AATTCAAAAACCCTTTAAGAACAACTGTCCACTCGAGTGGACAGTTGTTCTTAAAGGG,n/a
mouse,105243390,Gm39325,XR_870690.1,TRCN0000070332,XM_485785.1-568s1c1,GCCTTGGAATGTTCTTTCCAT,pLKO.1,1224,3UTR,86,85,,,Y,434043,LOC434043,CCGGGCCTTGGAATGTTCTTTCCATCTCGAGATGGAAAGAACATTCCAAGGCTTTTTG,AATTCAAAAAGCCTTGGAATGTTCTTTCCATCTCGAGATGGAAAGAACATTCCAAGGC,n/a
mouse,105243390,Gm39325,XR_870690.1,TRCN0000049648,NM_024641.2-3570s1c1,CCCATTATAGACATGGTGAAT,pLKO.1,1446,3UTR,77,85,,,Y,79694,MANEA,CCGGCCCATTATAGACATGGTGAATCTCGAGATTCACCATGTCTATAATGGGTTTTTG,AATTCAAAAACCCATTATAGACATGGTGAATCTCGAGATTCACCATGTCTATAATGGG,n/a
mouse,105243390,Gm39325,XR_870690.1,TRCN0000333838,NM_024641.2-3570s21c1,CCCATTATAGACATGGTGAAT,pLKO_005,1446,3UTR,77,85,,,Y,79694,MANEA,CCGGCCCATTATAGACATGGTGAATCTCGAGATTCACCATGTCTATAATGGGTTTTTG,AATTCAAAAACCCATTATAGACATGGTGAATCTCGAGATTCACCATGTCTATAATGGG,n/a
