Taxon,"Gene ID","Gene Symbol",Transcript,"Clone ID","Legacy Clone Name","Target Seq",Vector,"Match Position","Match Region","Match %","SDR Match %","Intrinsic Score","Adjusted Score","Matches Other Gene in Same Taxon?","Orig. Target Gene ID","Orig. Target Gene Symbol","Forward Oligo Sequence","Reverse Oligo Sequence",Addgene
human,105369617,LOC105369617,XR_931577.1,TRCN0000413006,NM_022781.4-636s21c1,TACGCACAGCAGCAAGCAATA,pLKO_005,592,3UTR,85,89,,,Y,152006,RNF38,CCGGTACGCACAGCAGCAAGCAATACTCGAGTATTGCTTGCTGCTGTGCGTATTTTTG,AATTCAAAAATACGCACAGCAGCAAGCAATACTCGAGTATTGCTTGCTGCTGTGCGTA,n/a
human,105369617,LOC105369617,XR_931577.1,TRCN0000180209,NM_001033564.1-634s1c1,CTGCACAAAGCAGCAAGGAAA,pLKO.1,591,3UTR,85,89,,,Y,619208,FAM229B,CCGGCTGCACAAAGCAGCAAGGAAACTCGAGTTTCCTTGCTGCTTTGTGCAGTTTTTG,AATTCAAAAACTGCACAAAGCAGCAAGGAAACTCGAGTTTCCTTGCTGCTTTGTGCAG,n/a
human,105369617,LOC105369617,XR_931577.1,TRCN0000164313,NM_145050.2-1412s1c1,CCACAGAGAGAATATCCAGTA,pLKO.1,332,3UTR,85,89,,,Y,137196,CCDC26,CCGGCCACAGAGAGAATATCCAGTACTCGAGTACTGGATATTCTCTCTGTGGTTTTTG,AATTCAAAAACCACAGAGAGAATATCCAGTACTCGAGTACTGGATATTCTCTCTGTGG,n/a
human,105369617,LOC105369617,XR_931577.1,TRCN0000164981,NM_001012717.1-707s1c1,GTTGTGTTCTTCCAGCTCCAT,pLKO.1,690,3UTR,85,89,,,Y,,,CCGGGTTGTGTTCTTCCAGCTCCATCTCGAGATGGAGCTGGAAGAACACAACTTTTTG,AATTCAAAAAGTTGTGTTCTTCCAGCTCCATCTCGAGATGGAGCTGGAAGAACACAAC,n/a
human,105369617,LOC105369617,XR_931577.1,TRCN0000116947,NM_198690.1-513s1c1,GCTCTGAGGATTCCTATTCAT,pLKO.1,918,3UTR,85,89,,,Y,386676,KRTAP10-9,CCGGGCTCTGAGGATTCCTATTCATCTCGAGATGAATAGGAATCCTCAGAGCTTTTTG,AATTCAAAAAGCTCTGAGGATTCCTATTCATCTCGAGATGAATAGGAATCCTCAGAGC,n/a
human,105369617,LOC105369617,XR_931577.1,TRCN0000337413,NM_001113324.1-365s21c1,GGGAGCACGCTGAGAACATTT,pLKO_005,2147,3UTR,85,89,,,Y,100134934,TEN1,CCGGGGGAGCACGCTGAGAACATTTCTCGAGAAATGTTCTCAGCGTGCTCCCTTTTTG,AATTCAAAAAGGGAGCACGCTGAGAACATTTCTCGAGAAATGTTCTCAGCGTGCTCCC,n/a
human,105369617,LOC105369617,XR_931577.1,TRCN0000112802,NM_020281.1-54s1c1,CCAACAGGAATCAGATAATGA,pLKO.1,557,3UTR,85,89,,,Y,17143,Magea7-ps,CCGGCCAACAGGAATCAGATAATGACTCGAGTCATTATCTGATTCCTGTTGGTTTTTG,AATTCAAAAACCAACAGGAATCAGATAATGACTCGAGTCATTATCTGATTCCTGTTGG,n/a
human,105369617,LOC105369617,XR_931577.1,TRCN0000109786,NM_010330.2-1053s1c1,GCCATCATTCTGCTTTGTGAA,pLKO.1,1228,3UTR,85,89,,,Y,13723,Emb,CCGGGCCATCATTCTGCTTTGTGAACTCGAGTTCACAAAGCAGAATGATGGCTTTTTG,AATTCAAAAAGCCATCATTCTGCTTTGTGAACTCGAGTTCACAAAGCAGAATGATGGC,n/a
human,105369617,LOC105369617,XR_931577.1,TRCN0000121505,NM_145382.2-926s1c1,CTGAAGCAGGTGAATCGTGTT,pLKO.1,1201,3UTR,85,89,,,Y,212483,Fam193b,CCGGCTGAAGCAGGTGAATCGTGTTCTCGAGAACACGATTCACCTGCTTCAGTTTTTG,AATTCAAAAACTGAAGCAGGTGAATCGTGTTCTCGAGAACACGATTCACCTGCTTCAG,n/a
human,105369617,LOC105369617,XR_931577.1,TRCN0000336677,NM_001144954.1-576s21c1,ATATAGACACAGGCTGAAATG,pLKO_005,2115,3UTR,80,89,,,Y,133491,C5orf47,CCGGATATAGACACAGGCTGAAATGCTCGAGCATTTCAGCCTGTGTCTATATTTTTTG,AATTCAAAAAATATAGACACAGGCTGAAATGCTCGAGCATTTCAGCCTGTGTCTATAT,n/a
human,105369617,LOC105369617,XR_931577.1,TRCN0000417823,NM_032946.2-1333s21c1,CTCAGTGCATTGCCTGAAACT,pLKO_005,1683,3UTR,80,89,,,Y,55998,NXF5,CCGGCTCAGTGCATTGCCTGAAACTCTCGAGAGTTTCAGGCAATGCACTGAGTTTTTG,AATTCAAAAACTCAGTGCATTGCCTGAAACTCTCGAGAGTTTCAGGCAATGCACTGAG,n/a
human,105369617,LOC105369617,XR_931577.1,TRCN0000157954,NM_025078.3-326s1c1,CGGATACTCTTCTGGTTTGGA,pLKO.1,1548,3UTR,80,89,,,Y,80148,SLC66A2,CCGGCGGATACTCTTCTGGTTTGGACTCGAGTCCAAACCAGAAGAGTATCCGTTTTTG,AATTCAAAAACGGATACTCTTCTGGTTTGGACTCGAGTCCAAACCAGAAGAGTATCCG,n/a
human,105369617,LOC105369617,XR_931577.1,TRCN0000147416,NM_032339.3-238s1c1,GATAGAGATAAATGGACAGCT,pLKO.1,2106,3UTR,80,89,,,Y,84299,MIEN1,CCGGGATAGAGATAAATGGACAGCTCTCGAGAGCTGTCCATTTATCTCTATCTTTTTG,AATTCAAAAAGATAGAGATAAATGGACAGCTCTCGAGAGCTGTCCATTTATCTCTATC,n/a
human,105369617,LOC105369617,XR_931577.1,TRCN0000126650,NM_145610.1-369s1c1,CGTTCCAGATCAGCAAGTATA,pLKO.1,88,3UTR,81,85,,,Y,235036,Ppan,CCGGCGTTCCAGATCAGCAAGTATACTCGAGTATACTTGCTGATCTGGAACGTTTTTG,AATTCAAAAACGTTCCAGATCAGCAAGTATACTCGAGTATACTTGCTGATCTGGAACG,n/a
human,105369617,LOC105369617,XR_931577.1,TRCN0000345472,NM_145610.2-452s21c1,GTTCCAGATCAGCAAGTATAC,pLKO_005,89,3UTR,81,85,,,Y,235036,Ppan,CCGGGTTCCAGATCAGCAAGTATACCTCGAGGTATACTTGCTGATCTGGAACTTTTTG,AATTCAAAAAGTTCCAGATCAGCAAGTATACCTCGAGGTATACTTGCTGATCTGGAAC,n/a
human,105369617,LOC105369617,XR_931577.1,TRCN0000356545,NM_000870.4-233s21c1,CACGTTTCTCTCGACGGTTAT,pLKO_005,1267,3UTR,77,85,,,Y,3360,HTR4,CCGGCACGTTTCTCTCGACGGTTATCTCGAGATAACCGTCGAGAGAAACGTGTTTTTG,AATTCAAAAACACGTTTCTCTCGACGGTTATCTCGAGATAACCGTCGAGAGAAACGTG,n/a
human,105369617,LOC105369617,XR_931577.1,TRCN0000103696,NM_133993.1-545s1c1,GCTGAACAAGAGCAGTGCAAT,pLKO.1,309,3UTR,77,85,,,Y,103136,Pwp1,CCGGGCTGAACAAGAGCAGTGCAATCTCGAGATTGCACTGCTCTTGTTCAGCTTTTTG,AATTCAAAAAGCTGAACAAGAGCAGTGCAATCTCGAGATTGCACTGCTCTTGTTCAGC,n/a
