Taxon,"Gene ID","Gene Symbol",Transcript,"Clone ID","Legacy Clone Name","Target Seq",Vector,"Match Position","Match Region","Match %","SDR Match %","Intrinsic Score","Adjusted Score","Matches Other Gene in Same Taxon?","Orig. Target Gene ID","Orig. Target Gene Symbol","Forward Oligo Sequence","Reverse Oligo Sequence",Addgene
human,105371493,LOC105371493,XR_934165.2,TRCN0000155836,NM_198582.1-3275s1c1,CCCAAAGTGCTGGGATTACAA,pLKO.1,45,3UTR,95,100,5.625,2.8125,Y,377007,KLHL30,CCGGCCCAAAGTGCTGGGATTACAACTCGAGTTGTAATCCCAGCACTTTGGGTTTTTG,AATTCAAAAACCCAAAGTGCTGGGATTACAACTCGAGTTGTAATCCCAGCACTTTGGG,n/a
human,105371493,LOC105371493,XR_934165.2,TRCN0000141025,NM_152361.1-835s1c1,CCCAAAGTGCTGGGATTACTT,pLKO.1,45,3UTR,90,100,5.625,2.8125,Y,126272,EID2B,CCGGCCCAAAGTGCTGGGATTACTTCTCGAGAAGTAATCCCAGCACTTTGGGTTTTTG,AATTCAAAAACCCAAAGTGCTGGGATTACTTCTCGAGAAGTAATCCCAGCACTTTGGG,n/a
human,105371493,LOC105371493,XR_934165.2,TRCN0000204533,NM_001013675.1-1987s1c1,CCTCCCAAAGTGCTGGAATTA,pLKO.1,42,3UTR,95,95,,,Y,400891,LRRC74B,CCGGCCTCCCAAAGTGCTGGAATTACTCGAGTAATTCCAGCACTTTGGGAGGTTTTTG,AATTCAAAAACCTCCCAAAGTGCTGGAATTACTCGAGTAATTCCAGCACTTTGGGAGG,n/a
human,105371493,LOC105371493,XR_934165.2,TRCN0000072628,NM_016065.3-1636s1c1,CCTCCCAAAGTGCTAGGATTA,pLKO.1,42,3UTR,95,95,,,Y,51021,MRPS16,CCGGCCTCCCAAAGTGCTAGGATTACTCGAGTAATCCTAGCACTTTGGGAGGTTTTTG,AATTCAAAAACCTCCCAAAGTGCTAGGATTACTCGAGTAATCCTAGCACTTTGGGAGG,n/a
human,105371493,LOC105371493,XR_934165.2,TRCN0000165027,NM_001013636.1-513s1c1,GAACTCCTGACCTCAAGTGAT,pLKO.1,8,3UTR,95,95,,,Y,387873,LOC387873,CCGGGAACTCCTGACCTCAAGTGATCTCGAGATCACTTGAGGTCAGGAGTTCTTTTTG,AATTCAAAAAGAACTCCTGACCTCAAGTGATCTCGAGATCACTTGAGGTCAGGAGTTC,n/a
human,105371493,LOC105371493,XR_934165.2,TRCN0000155187,NM_001003795.1-3305s1c1,GAGATGAGGTTTCACCATGTT,pLKO.1,455,3UTR,95,95,,,Y,389524,GTF2IRD2B,CCGGGAGATGAGGTTTCACCATGTTCTCGAGAACATGGTGAAACCTCATCTCTTTTTG,AATTCAAAAAGAGATGAGGTTTCACCATGTTCTCGAGAACATGGTGAAACCTCATCTC,n/a
human,105371493,LOC105371493,XR_934165.2,TRCN0000168774,NM_001013670.1-1394s1c1,GAGATGGAGTTTCACCATGTT,pLKO.1,455,3UTR,95,95,,,Y,400464,LOC400464,CCGGGAGATGGAGTTTCACCATGTTCTCGAGAACATGGTGAAACTCCATCTCTTTTTG,AATTCAAAAAGAGATGGAGTTTCACCATGTTCTCGAGAACATGGTGAAACTCCATCTC,n/a
human,105371493,LOC105371493,XR_934165.2,TRCN0000164801,NM_016534.2-1646s1c1,CCTCCCAAAGTACTGGGATTA,pLKO.1,42,3UTR,95,95,,,Y,51275,MAPKAPK5-AS1,CCGGCCTCCCAAAGTACTGGGATTACTCGAGTAATCCCAGTACTTTGGGAGGTTTTTG,AATTCAAAAACCTCCCAAAGTACTGGGATTACTCGAGTAATCCCAGTACTTTGGGAGG,n/a
human,105371493,LOC105371493,XR_934165.2,TRCN0000008902,NM_016540.2-2291s1c1,CCTCCCAAAGTGTTGGGATTA,pLKO.1,42,3UTR,95,95,,,Y,10888,GPR83,CCGGCCTCCCAAAGTGTTGGGATTACTCGAGTAATCCCAACACTTTGGGAGGTTTTTG,AATTCAAAAACCTCCCAAAGTGTTGGGATTACTCGAGTAATCCCAACACTTTGGGAGG,n/a
human,105371493,LOC105371493,XR_934165.2,TRCN0000156315,NM_020702.1-3633s1c1,CCTCCCAAAGTGTTGGGATTA,pLKO.1,42,3UTR,95,95,,,Y,57462,MYORG,CCGGCCTCCCAAAGTGTTGGGATTACTCGAGTAATCCCAACACTTTGGGAGGTTTTTG,AATTCAAAAACCTCCCAAAGTGTTGGGATTACTCGAGTAATCCCAACACTTTGGGAGG,n/a
human,105371493,LOC105371493,XR_934165.2,TRCN0000116227,NM_024930.1-2895s1c1,CCTCCCAAAGTTCTGGGATTA,pLKO.1,42,3UTR,95,95,,,Y,79993,ELOVL7,CCGGCCTCCCAAAGTTCTGGGATTACTCGAGTAATCCCAGAACTTTGGGAGGTTTTTG,AATTCAAAAACCTCCCAAAGTTCTGGGATTACTCGAGTAATCCCAGAACTTTGGGAGG,n/a
human,105371493,LOC105371493,XR_934165.2,TRCN0000164591,NM_003281.3-2102s1c1,CCTCCCAAAGTTCTGGGATTA,pLKO.1,42,3UTR,95,95,,,Y,7135,TNNI1,CCGGCCTCCCAAAGTTCTGGGATTACTCGAGTAATCCCAGAACTTTGGGAGGTTTTTG,AATTCAAAAACCTCCCAAAGTTCTGGGATTACTCGAGTAATCCCAGAACTTTGGGAGG,n/a
human,105371493,LOC105371493,XR_934165.2,TRCN0000040213,NM_000618.2-6169s1c1,CCTCCCAAATTGCTGGGATTA,pLKO.1,42,3UTR,95,95,,,Y,3479,IGF1,CCGGCCTCCCAAATTGCTGGGATTACTCGAGTAATCCCAGCAATTTGGGAGGTTTTTG,AATTCAAAAACCTCCCAAATTGCTGGGATTACTCGAGTAATCCCAGCAATTTGGGAGG,n/a
human,105371493,LOC105371493,XR_934165.2,TRCN0000162795,NM_017842.1-1079s1c1,CTTCCAAAGTGCTGGGATTAT,pLKO.1,43,3UTR,90,95,,,Y,55652,SLC48A1,CCGGCTTCCAAAGTGCTGGGATTATCTCGAGATAATCCCAGCACTTTGGAAGTTTTTG,AATTCAAAAACTTCCAAAGTGCTGGGATTATCTCGAGATAATCCCAGCACTTTGGAAG,n/a
human,105371493,LOC105371493,XR_934165.2,TRCN0000140657,NM_012099.1-2957s1c1,CCTCCCAAAGTGCTAGGATAA,pLKO.1,42,3UTR,90,95,,,Y,10849,CD3EAP,CCGGCCTCCCAAAGTGCTAGGATAACTCGAGTTATCCTAGCACTTTGGGAGGTTTTTG,AATTCAAAAACCTCCCAAAGTGCTAGGATAACTCGAGTTATCCTAGCACTTTGGGAGG,n/a
human,105371493,LOC105371493,XR_934165.2,TRCN0000047783,NM_017516.1-1624s1c1,GCCTCCAAAGTGCTGGAATTA,pLKO.1,41,3UTR,90,90,,,Y,54734,RAB39A,CCGGGCCTCCAAAGTGCTGGAATTACTCGAGTAATTCCAGCACTTTGGAGGCTTTTTG,AATTCAAAAAGCCTCCAAAGTGCTGGAATTACTCGAGTAATTCCAGCACTTTGGAGGC,n/a
human,105371493,LOC105371493,XR_934165.2,TRCN0000103495,NM_019866.1-1984s1c1,GCCTCTCAAATGCTGGGATTA,pLKO.1,41,3UTR,90,90,,,Y,272382,Spib,CCGGGCCTCTCAAATGCTGGGATTACTCGAGTAATCCCAGCATTTGAGAGGCTTTTTG,AATTCAAAAAGCCTCTCAAATGCTGGGATTACTCGAGTAATCCCAGCATTTGAGAGGC,n/a
human,105371493,LOC105371493,XR_934165.2,TRCN0000198922,NM_178897.2-2085s1c1,GCTTCCCAAATGCTGGGATTA,pLKO.1,41,3UTR,90,90,,,Y,100929,Tyw1,CCGGGCTTCCCAAATGCTGGGATTACTCGAGTAATCCCAGCATTTGGGAAGCTTTTTG,AATTCAAAAAGCTTCCCAAATGCTGGGATTACTCGAGTAATCCCAGCATTTGGGAAGC,n/a
human,105371493,LOC105371493,XR_934165.2,TRCN0000091448,NM_013513.1-2495s1c1,CCTCCCAAGTACTGGGATTAA,pLKO.1,42,3UTR,86,90,,,Y,13828,Epb42,CCGGCCTCCCAAGTACTGGGATTAACTCGAGTTAATCCCAGTACTTGGGAGGTTTTTG,AATTCAAAAACCTCCCAAGTACTGGGATTAACTCGAGTTAATCCCAGTACTTGGGAGG,n/a
human,105371493,LOC105371493,XR_934165.2,TRCN0000111000,NM_009730.1-4992s1c1,GCCTCACAAATGCTGGGATAA,pLKO.1,41,3UTR,86,90,,,Y,11990,Atrn,CCGGGCCTCACAAATGCTGGGATAACTCGAGTTATCCCAGCATTTGTGAGGCTTTTTG,AATTCAAAAAGCCTCACAAATGCTGGGATAACTCGAGTTATCCCAGCATTTGTGAGGC,n/a
human,105371493,LOC105371493,XR_934165.2,TRCN0000042823,NM_024055.2-973s1c1,CCTCACAAAGTGCTAGGATTA,pLKO.1,42,3UTR,90,89,,,Y,64924,SLC30A5,CCGGCCTCACAAAGTGCTAGGATTACTCGAGTAATCCTAGCACTTTGTGAGGTTTTTG,AATTCAAAAACCTCACAAAGTGCTAGGATTACTCGAGTAATCCTAGCACTTTGTGAGG,n/a
human,105371493,LOC105371493,XR_934165.2,TRCN0000082462,XM_371492.2-638s1c1,CCTCCCAAAGTGCCAGGATTA,pLKO.1,42,3UTR,90,89,,,Y,388949,LOC388949,CCGGCCTCCCAAAGTGCCAGGATTACTCGAGTAATCCTGGCACTTTGGGAGGTTTTTG,AATTCAAAAACCTCCCAAAGTGCCAGGATTACTCGAGTAATCCTGGCACTTTGGGAGG,n/a
human,105371493,LOC105371493,XR_934165.2,TRCN0000165736,NM_175901.3-1946s1c1,CCTCCCTAAGTGTTGGGATTA,pLKO.1,42,3UTR,90,89,,,Y,283932,FBXL19-AS1,CCGGCCTCCCTAAGTGTTGGGATTACTCGAGTAATCCCAACACTTAGGGAGGTTTTTG,AATTCAAAAACCTCCCTAAGTGTTGGGATTACTCGAGTAATCCCAACACTTAGGGAGG,n/a
human,105371493,LOC105371493,XR_934165.2,TRCN0000166560,NM_207497.1-412s1c1,CCTCCGAAAGTGCTAGGATTA,pLKO.1,42,3UTR,90,89,,,Y,401253,LINC00336,CCGGCCTCCGAAAGTGCTAGGATTACTCGAGTAATCCTAGCACTTTCGGAGGTTTTTG,AATTCAAAAACCTCCGAAAGTGCTAGGATTACTCGAGTAATCCTAGCACTTTCGGAGG,n/a
human,105371493,LOC105371493,XR_934165.2,TRCN0000164091,NM_024795.1-1273s1c1,CCTCCTAAAGTGCTGCGATTA,pLKO.1,42,3UTR,90,89,,,Y,79853,TM4SF20,CCGGCCTCCTAAAGTGCTGCGATTACTCGAGTAATCGCAGCACTTTAGGAGGTTTTTG,AATTCAAAAACCTCCTAAAGTGCTGCGATTACTCGAGTAATCGCAGCACTTTAGGAGG,n/a
human,105371493,LOC105371493,XR_934165.2,TRCN0000165534,NM_001012717.1-362s1c1,GAGACAGGGTTTCACCATGTT,pLKO.1,455,3UTR,90,89,,,Y,,,CCGGGAGACAGGGTTTCACCATGTTCTCGAGAACATGGTGAAACCCTGTCTCTTTTTG,AATTCAAAAAGAGACAGGGTTTCACCATGTTCTCGAGAACATGGTGAAACCCTGTCTC,n/a
human,105371493,LOC105371493,XR_934165.2,TRCN0000140238,NM_024895.3-1807s1c1,GTCTCCCAAAGTGCTAGGATT,pLKO.1,41,3UTR,90,89,,,Y,79955,PDZD7,CCGGGTCTCCCAAAGTGCTAGGATTCTCGAGAATCCTAGCACTTTGGGAGACTTTTTG,AATTCAAAAAGTCTCCCAAAGTGCTAGGATTCTCGAGAATCCTAGCACTTTGGGAGAC,n/a
human,105371493,LOC105371493,XR_934165.2,TRCN0000129445,NM_145048.2-1500s1c1,GACTTCCAAAGTGCTGGGATT,pLKO.1,41,3UTR,90,89,,,Y,133015,PACRGL,CCGGGACTTCCAAAGTGCTGGGATTCTCGAGAATCCCAGCACTTTGGAAGTCTTTTTG,AATTCAAAAAGACTTCCAAAGTGCTGGGATTCTCGAGAATCCCAGCACTTTGGAAGTC,n/a
human,105371493,LOC105371493,XR_934165.2,TRCN0000140759,NM_018265.1-3067s1c1,GCCTTTCAAAGTGCTGGGATT,pLKO.1,41,3UTR,90,89,,,Y,55765,INAVA,CCGGGCCTTTCAAAGTGCTGGGATTCTCGAGAATCCCAGCACTTTGAAAGGCTTTTTG,AATTCAAAAAGCCTTTCAAAGTGCTGGGATTCTCGAGAATCCCAGCACTTTGAAAGGC,n/a
human,105371493,LOC105371493,XR_934165.2,TRCN0000155070,NM_017873.2-2761s1c1,GCCTTTCAAAGTGCTGGGATT,pLKO.1,41,3UTR,90,89,,,Y,140459,ASB6,CCGGGCCTTTCAAAGTGCTGGGATTCTCGAGAATCCCAGCACTTTGAAAGGCTTTTTG,AATTCAAAAAGCCTTTCAAAGTGCTGGGATTCTCGAGAATCCCAGCACTTTGAAAGGC,n/a
human,105371493,LOC105371493,XR_934165.2,TRCN0000163829,NM_173639.1-1102s1c1,CCTCCCAAATTACTGGGATTA,pLKO.1,42,3UTR,90,89,,,Y,284618,RUSC1-AS1,CCGGCCTCCCAAATTACTGGGATTACTCGAGTAATCCCAGTAATTTGGGAGGTTTTTG,AATTCAAAAACCTCCCAAATTACTGGGATTACTCGAGTAATCCCAGTAATTTGGGAGG,n/a
human,105371493,LOC105371493,XR_934165.2,TRCN0000057398,NM_002261.1-793s1c1,CCTCCCAAGTTGCTGGGATTA,pLKO.1,42,3UTR,90,89,,,Y,3823,KLRC3,CCGGCCTCCCAAGTTGCTGGGATTACTCGAGTAATCCCAGCAACTTGGGAGGTTTTTG,AATTCAAAAACCTCCCAAGTTGCTGGGATTACTCGAGTAATCCCAGCAACTTGGGAGG,n/a
human,105371493,LOC105371493,XR_934165.2,TRCN0000140374,NM_025042.2-1098s1c1,GCTTCCCAAAGTACTGGGATT,pLKO.1,41,3UTR,90,89,,,Y,,,CCGGGCTTCCCAAAGTACTGGGATTCTCGAGAATCCCAGTACTTTGGGAAGCTTTTTG,AATTCAAAAAGCTTCCCAAAGTACTGGGATTCTCGAGAATCCCAGTACTTTGGGAAGC,n/a
human,105371493,LOC105371493,XR_934165.2,TRCN0000220669,NM_010019.2-468s1c2,CACCAGCTTCATTAAGCAGAT,pLKO.1,437,3UTR,85,89,,,Y,13143,Dapk2,CCGGCACCAGCTTCATTAAGCAGATCTCGAGATCTGCTTAATGAAGCTGGTGTTTTTG,AATTCAAAAACACCAGCTTCATTAAGCAGATCTCGAGATCTGCTTAATGAAGCTGGTG,n/a
human,105371493,LOC105371493,XR_934165.2,TRCN0000178813,NM_026334.1-470s1c1,CAGCTTTGATGAAATGGCTAA,pLKO.1,154,3UTR,85,89,,,Y,67717,Lipf,CCGGCAGCTTTGATGAAATGGCTAACTCGAGTTAGCCATTTCATCAAAGCTGTTTTTG,AATTCAAAAACAGCTTTGATGAAATGGCTAACTCGAGTTAGCCATTTCATCAAAGCTG,n/a
human,105371493,LOC105371493,XR_934165.2,TRCN0000379144,NM_025473.3-910s21c1,ATCCAGCTACCAAGATGAATG,pLKO_005,185,3UTR,80,89,,,Y,66294,Fam3a,CCGGATCCAGCTACCAAGATGAATGCTCGAGCATTCATCTTGGTAGCTGGATTTTTTG,AATTCAAAAAATCCAGCTACCAAGATGAATGCTCGAGCATTCATCTTGGTAGCTGGAT,n/a
human,105371493,LOC105371493,XR_934165.2,TRCN0000161857,NM_152483.1-1473s1c1,GCTTGAAGGAAATGTCTACTT,pLKO.1,156,3UTR,80,89,,,Y,148231,LINC00905,CCGGGCTTGAAGGAAATGTCTACTTCTCGAGAAGTAGACATTTCCTTCAAGCTTTTTG,AATTCAAAAAGCTTGAAGGAAATGTCTACTTCTCGAGAAGTAGACATTTCCTTCAAGC,n/a
human,105371493,LOC105371493,XR_934165.2,TRCN0000064762,NM_198080.1-277s1c1,AGGAGAATACACACATCACAA,pLKO.1,135,3UTR,81,85,,,Y,253827,MSRB3,CCGGAGGAGAATACACACATCACAACTCGAGTTGTGATGTGTGTATTCTCCTTTTTTG,AATTCAAAAAAGGAGAATACACACATCACAACTCGAGTTGTGATGTGTGTATTCTCCT,n/a
human,105371493,LOC105371493,XR_934165.2,TRCN0000280643,NM_152287.3-798s21c1,CCACGACTACACCATGGATAC,pLKO_005,279,3UTR,77,85,,,Y,92822,ZNF276,CCGGCCACGACTACACCATGGATACCTCGAGGTATCCATGGTGTAGTCGTGGTTTTTG,AATTCAAAAACCACGACTACACCATGGATACCTCGAGGTATCCATGGTGTAGTCGTGG,n/a
human,105371493,LOC105371493,XR_934165.2,TRCN0000414375,NM_032369.2-1213s21c1,TTCTCATGTTGAACACTTTAG,pLKO_005,88,3UTR,77,85,,,Y,84329,HVCN1,CCGGTTCTCATGTTGAACACTTTAGCTCGAGCTAAAGTGTTCAACATGAGAATTTTTG,AATTCAAAAATTCTCATGTTGAACACTTTAGCTCGAGCTAAAGTGTTCAACATGAGAA,n/a
