Taxon,"Gene ID","Gene Symbol",Transcript,"Clone ID","Legacy Clone Name","Target Seq",Vector,"Match Position","Match Region","Match %","SDR Match %","Intrinsic Score","Adjusted Score","Matches Other Gene in Same Taxon?","Orig. Target Gene ID","Orig. Target Gene Symbol","Forward Oligo Sequence","Reverse Oligo Sequence",Addgene
human,105376844,LOC105376844,XR_934912.3,TRCN0000263039,NM_001039083.3-515s21c1,TGGTCAGCTGGACTCCATACT,pLKO_005,262,3UTR,100,100,4.95,2.475,Y,100506084,ARL17B,CCGGTGGTCAGCTGGACTCCATACTCTCGAGAGTATGGAGTCCAGCTGACCATTTTTG,AATTCAAAAATGGTCAGCTGGACTCCATACTCTCGAGAGTATGGAGTCCAGCTGACCA,n/a
human,105376844,LOC105376844,XR_934912.3,TRCN0000139147,NM_016632.1-447s1c1,CCCATCTCTTGGACAGATGAT,pLKO.1,482,3UTR,100,100,.495,.2475,Y,51326,ARL17A,CCGGCCCATCTCTTGGACAGATGATCTCGAGATCATCTGTCCAAGAGATGGGTTTTTG,AATTCAAAAACCCATCTCTTGGACAGATGATCTCGAGATCATCTGTCCAAGAGATGGG,n/a
human,105376844,LOC105376844,XR_934912.3,TRCN0000166030,NM_005821.2-472s1c1,CCTCTGGAAATCAGCTGTGTT,pLKO.1,364,3UTR,90,100,4.95,2.475,Y,10230,NBR2,CCGGCCTCTGGAAATCAGCTGTGTTCTCGAGAACACAGCTGATTTCCAGAGGTTTTTG,AATTCAAAAACCTCTGGAAATCAGCTGTGTTCTCGAGAACACAGCTGATTTCCAGAGG,n/a
human,105376844,LOC105376844,XR_934912.3,TRCN0000344481,NM_001039083.3-582s21c1,AGCAGCGGTTTCCCAAGTTTC,pLKO_005,329,3UTR,95,95,,,Y,100506084,ARL17B,CCGGAGCAGCGGTTTCCCAAGTTTCCTCGAGGAAACTTGGGAAACCGCTGCTTTTTTG,AATTCAAAAAAGCAGCGGTTTCCCAAGTTTCCTCGAGGAAACTTGGGAAACCGCTGCT,n/a
human,105376844,LOC105376844,XR_934912.3,TRCN0000371106,NM_001039083.3-451s21c1,GAATGTGGAAAGGAGGTAGAA,pLKO_005,198,3UTR,95,95,,,Y,100506084,ARL17B,CCGGGAATGTGGAAAGGAGGTAGAACTCGAGTTCTACCTCCTTTCCACATTCTTTTTG,AATTCAAAAAGAATGTGGAAAGGAGGTAGAACTCGAGTTCTACCTCCTTTCCACATTC,n/a
human,105376844,LOC105376844,XR_934912.3,TRCN0000202132,NM_177904.2-639s1c1,CCCAGCAAGACACATCAAGAA,pLKO.1,127,3UTR,81,90,,,Y,330837,6030452D12Rik,CCGGCCCAGCAAGACACATCAAGAACTCGAGTTCTTGATGTGTCTTGCTGGGTTTTTG,AATTCAAAAACCCAGCAAGACACATCAAGAACTCGAGTTCTTGATGTGTCTTGCTGGG,n/a
human,105376844,LOC105376844,XR_934912.3,TRCN0000148866,NM_152614.1-665s1c1,CTGAAGCTGAAGCTTTACCAT,pLKO.1,783,3UTR,85,89,,,Y,165100,TEX44,CCGGCTGAAGCTGAAGCTTTACCATCTCGAGATGGTAAAGCTTCAGCTTCAGTTTTTG,AATTCAAAAACTGAAGCTGAAGCTTTACCATCTCGAGATGGTAAAGCTTCAGCTTCAG,n/a
human,105376844,LOC105376844,XR_934912.3,TRCN0000263551,NM_145270.1-336s21c1,GAAGCCCAAGAAGCCACACTA,pLKO_005,123,3UTR,81,85,,,Y,146325,PRR35,CCGGGAAGCCCAAGAAGCCACACTACTCGAGTAGTGTGGCTTCTTGGGCTTCTTTTTG,AATTCAAAAAGAAGCCCAAGAAGCCACACTACTCGAGTAGTGTGGCTTCTTGGGCTTC,n/a
human,105376844,LOC105376844,XR_934912.3,TRCN0000032790,XM_125854.2-692s1c1,GCTGAAGGAACTCAGCAGAAA,pLKO.1,315,3UTR,81,85,,,Y,71761,Amdhd1,CCGGGCTGAAGGAACTCAGCAGAAACTCGAGTTTCTGCTGAGTTCCTTCAGCTTTTTG,AATTCAAAAAGCTGAAGGAACTCAGCAGAAACTCGAGTTTCTGCTGAGTTCCTTCAGC,n/a
human,105376844,LOC105376844,XR_934912.3,TRCN0000180932,NM_152771.1-651s1c1,GATTATGCAAACGGAGGCAAG,pLKO.1,771,3UTR,77,85,,,Y,255193,CSNK1G2-AS1,CCGGGATTATGCAAACGGAGGCAAGCTCGAGCTTGCCTCCGTTTGCATAATCTTTTTG,AATTCAAAAAGATTATGCAAACGGAGGCAAGCTCGAGCTTGCCTCCGTTTGCATAATC,n/a
