Taxon,"Gene ID","Gene Symbol",Transcript,"Clone ID","Legacy Clone Name","Target Seq",Vector,"Match Position","Match Region","Match %","SDR Match %","Intrinsic Score","Adjusted Score","Matches Other Gene in Same Taxon?","Orig. Target Gene ID","Orig. Target Gene Symbol","Forward Oligo Sequence","Reverse Oligo Sequence",Addgene
human,105369373,LOC105369373,XR_950279.2,TRCN0000155836,NM_198582.1-3275s1c1,CCCAAAGTGCTGGGATTACAA,pLKO.1,32,3UTR,95,100,5.625,2.8125,Y,377007,KLHL30,CCGGCCCAAAGTGCTGGGATTACAACTCGAGTTGTAATCCCAGCACTTTGGGTTTTTG,AATTCAAAAACCCAAAGTGCTGGGATTACAACTCGAGTTGTAATCCCAGCACTTTGGG,n/a
human,105369373,LOC105369373,XR_950279.2,TRCN0000141025,NM_152361.1-835s1c1,CCCAAAGTGCTGGGATTACTT,pLKO.1,32,3UTR,90,100,5.625,2.8125,Y,126272,EID2B,CCGGCCCAAAGTGCTGGGATTACTTCTCGAGAAGTAATCCCAGCACTTTGGGTTTTTG,AATTCAAAAACCCAAAGTGCTGGGATTACTTCTCGAGAAGTAATCCCAGCACTTTGGG,n/a
human,105369373,LOC105369373,XR_950279.2,TRCN0000204533,NM_001013675.1-1987s1c1,CCTCCCAAAGTGCTGGAATTA,pLKO.1,29,3UTR,95,95,,,Y,400891,LRRC74B,CCGGCCTCCCAAAGTGCTGGAATTACTCGAGTAATTCCAGCACTTTGGGAGGTTTTTG,AATTCAAAAACCTCCCAAAGTGCTGGAATTACTCGAGTAATTCCAGCACTTTGGGAGG,n/a
human,105369373,LOC105369373,XR_950279.2,TRCN0000072628,NM_016065.3-1636s1c1,CCTCCCAAAGTGCTAGGATTA,pLKO.1,29,3UTR,95,95,,,Y,51021,MRPS16,CCGGCCTCCCAAAGTGCTAGGATTACTCGAGTAATCCTAGCACTTTGGGAGGTTTTTG,AATTCAAAAACCTCCCAAAGTGCTAGGATTACTCGAGTAATCCTAGCACTTTGGGAGG,n/a
human,105369373,LOC105369373,XR_950279.2,TRCN0000164801,NM_016534.2-1646s1c1,CCTCCCAAAGTACTGGGATTA,pLKO.1,29,3UTR,95,95,,,Y,51275,MAPKAPK5-AS1,CCGGCCTCCCAAAGTACTGGGATTACTCGAGTAATCCCAGTACTTTGGGAGGTTTTTG,AATTCAAAAACCTCCCAAAGTACTGGGATTACTCGAGTAATCCCAGTACTTTGGGAGG,n/a
human,105369373,LOC105369373,XR_950279.2,TRCN0000008902,NM_016540.2-2291s1c1,CCTCCCAAAGTGTTGGGATTA,pLKO.1,29,3UTR,95,95,,,Y,10888,GPR83,CCGGCCTCCCAAAGTGTTGGGATTACTCGAGTAATCCCAACACTTTGGGAGGTTTTTG,AATTCAAAAACCTCCCAAAGTGTTGGGATTACTCGAGTAATCCCAACACTTTGGGAGG,n/a
human,105369373,LOC105369373,XR_950279.2,TRCN0000156315,NM_020702.1-3633s1c1,CCTCCCAAAGTGTTGGGATTA,pLKO.1,29,3UTR,95,95,,,Y,57462,MYORG,CCGGCCTCCCAAAGTGTTGGGATTACTCGAGTAATCCCAACACTTTGGGAGGTTTTTG,AATTCAAAAACCTCCCAAAGTGTTGGGATTACTCGAGTAATCCCAACACTTTGGGAGG,n/a
human,105369373,LOC105369373,XR_950279.2,TRCN0000116227,NM_024930.1-2895s1c1,CCTCCCAAAGTTCTGGGATTA,pLKO.1,29,3UTR,95,95,,,Y,79993,ELOVL7,CCGGCCTCCCAAAGTTCTGGGATTACTCGAGTAATCCCAGAACTTTGGGAGGTTTTTG,AATTCAAAAACCTCCCAAAGTTCTGGGATTACTCGAGTAATCCCAGAACTTTGGGAGG,n/a
human,105369373,LOC105369373,XR_950279.2,TRCN0000164591,NM_003281.3-2102s1c1,CCTCCCAAAGTTCTGGGATTA,pLKO.1,29,3UTR,95,95,,,Y,7135,TNNI1,CCGGCCTCCCAAAGTTCTGGGATTACTCGAGTAATCCCAGAACTTTGGGAGGTTTTTG,AATTCAAAAACCTCCCAAAGTTCTGGGATTACTCGAGTAATCCCAGAACTTTGGGAGG,n/a
human,105369373,LOC105369373,XR_950279.2,TRCN0000040213,NM_000618.2-6169s1c1,CCTCCCAAATTGCTGGGATTA,pLKO.1,29,3UTR,95,95,,,Y,3479,IGF1,CCGGCCTCCCAAATTGCTGGGATTACTCGAGTAATCCCAGCAATTTGGGAGGTTTTTG,AATTCAAAAACCTCCCAAATTGCTGGGATTACTCGAGTAATCCCAGCAATTTGGGAGG,n/a
human,105369373,LOC105369373,XR_950279.2,TRCN0000166959,NM_020772.1-1393s1c1,GAACAAATTAAGACTAGCCTT,pLKO.1,385,3UTR,90,95,,,Y,57532,NUFIP2,CCGGGAACAAATTAAGACTAGCCTTCTCGAGAAGGCTAGTCTTAATTTGTTCTTTTTG,AATTCAAAAAGAACAAATTAAGACTAGCCTTCTCGAGAAGGCTAGTCTTAATTTGTTC,n/a
human,105369373,LOC105369373,XR_950279.2,TRCN0000349672,NM_020772.2-1482s21c1,GAACAAATTAAGACTAGCCTT,pLKO_005,385,3UTR,90,95,,,Y,57532,NUFIP2,CCGGGAACAAATTAAGACTAGCCTTCTCGAGAAGGCTAGTCTTAATTTGTTCTTTTTG,AATTCAAAAAGAACAAATTAAGACTAGCCTTCTCGAGAAGGCTAGTCTTAATTTGTTC,n/a
human,105369373,LOC105369373,XR_950279.2,TRCN0000162795,NM_017842.1-1079s1c1,CTTCCAAAGTGCTGGGATTAT,pLKO.1,30,3UTR,90,95,,,Y,55652,SLC48A1,CCGGCTTCCAAAGTGCTGGGATTATCTCGAGATAATCCCAGCACTTTGGAAGTTTTTG,AATTCAAAAACTTCCAAAGTGCTGGGATTATCTCGAGATAATCCCAGCACTTTGGAAG,n/a
human,105369373,LOC105369373,XR_950279.2,TRCN0000140657,NM_012099.1-2957s1c1,CCTCCCAAAGTGCTAGGATAA,pLKO.1,29,3UTR,90,95,,,Y,10849,CD3EAP,CCGGCCTCCCAAAGTGCTAGGATAACTCGAGTTATCCTAGCACTTTGGGAGGTTTTTG,AATTCAAAAACCTCCCAAAGTGCTAGGATAACTCGAGTTATCCTAGCACTTTGGGAGG,n/a
human,105369373,LOC105369373,XR_950279.2,TRCN0000047783,NM_017516.1-1624s1c1,GCCTCCAAAGTGCTGGAATTA,pLKO.1,28,3UTR,90,90,,,Y,54734,RAB39A,CCGGGCCTCCAAAGTGCTGGAATTACTCGAGTAATTCCAGCACTTTGGAGGCTTTTTG,AATTCAAAAAGCCTCCAAAGTGCTGGAATTACTCGAGTAATTCCAGCACTTTGGAGGC,n/a
human,105369373,LOC105369373,XR_950279.2,TRCN0000103495,NM_019866.1-1984s1c1,GCCTCTCAAATGCTGGGATTA,pLKO.1,28,3UTR,90,90,,,Y,272382,Spib,CCGGGCCTCTCAAATGCTGGGATTACTCGAGTAATCCCAGCATTTGAGAGGCTTTTTG,AATTCAAAAAGCCTCTCAAATGCTGGGATTACTCGAGTAATCCCAGCATTTGAGAGGC,n/a
human,105369373,LOC105369373,XR_950279.2,TRCN0000198922,NM_178897.2-2085s1c1,GCTTCCCAAATGCTGGGATTA,pLKO.1,28,3UTR,90,90,,,Y,100929,Tyw1,CCGGGCTTCCCAAATGCTGGGATTACTCGAGTAATCCCAGCATTTGGGAAGCTTTTTG,AATTCAAAAAGCTTCCCAAATGCTGGGATTACTCGAGTAATCCCAGCATTTGGGAAGC,n/a
human,105369373,LOC105369373,XR_950279.2,TRCN0000091448,NM_013513.1-2495s1c1,CCTCCCAAGTACTGGGATTAA,pLKO.1,29,3UTR,86,90,,,Y,13828,Epb42,CCGGCCTCCCAAGTACTGGGATTAACTCGAGTTAATCCCAGTACTTGGGAGGTTTTTG,AATTCAAAAACCTCCCAAGTACTGGGATTAACTCGAGTTAATCCCAGTACTTGGGAGG,n/a
human,105369373,LOC105369373,XR_950279.2,TRCN0000111000,NM_009730.1-4992s1c1,GCCTCACAAATGCTGGGATAA,pLKO.1,28,3UTR,86,90,,,Y,11990,Atrn,CCGGGCCTCACAAATGCTGGGATAACTCGAGTTATCCCAGCATTTGTGAGGCTTTTTG,AATTCAAAAAGCCTCACAAATGCTGGGATAACTCGAGTTATCCCAGCATTTGTGAGGC,n/a
human,105369373,LOC105369373,XR_950279.2,TRCN0000059333,NM_005692.3-1117s1c1,GCACACATGAAGAACTACATT,pLKO.1,411,3UTR,81,90,,,Y,10061,ABCF2,CCGGGCACACATGAAGAACTACATTCTCGAGAATGTAGTTCTTCATGTGTGCTTTTTG,AATTCAAAAAGCACACATGAAGAACTACATTCTCGAGAATGTAGTTCTTCATGTGTGC,n/a
human,105369373,LOC105369373,XR_950279.2,TRCN0000362225,NM_177706.4-1285s21c1,GGACATTAGAGAATCATTAAA,pLKO_005,436,3UTR,90,89,,,Y,237300,Gm4922,CCGGGGACATTAGAGAATCATTAAACTCGAGTTTAATGATTCTCTAATGTCCTTTTTG,AATTCAAAAAGGACATTAGAGAATCATTAAACTCGAGTTTAATGATTCTCTAATGTCC,n/a
human,105369373,LOC105369373,XR_950279.2,TRCN0000042823,NM_024055.2-973s1c1,CCTCACAAAGTGCTAGGATTA,pLKO.1,29,3UTR,90,89,,,Y,64924,SLC30A5,CCGGCCTCACAAAGTGCTAGGATTACTCGAGTAATCCTAGCACTTTGTGAGGTTTTTG,AATTCAAAAACCTCACAAAGTGCTAGGATTACTCGAGTAATCCTAGCACTTTGTGAGG,n/a
human,105369373,LOC105369373,XR_950279.2,TRCN0000082462,XM_371492.2-638s1c1,CCTCCCAAAGTGCCAGGATTA,pLKO.1,29,3UTR,90,89,,,Y,388949,LOC388949,CCGGCCTCCCAAAGTGCCAGGATTACTCGAGTAATCCTGGCACTTTGGGAGGTTTTTG,AATTCAAAAACCTCCCAAAGTGCCAGGATTACTCGAGTAATCCTGGCACTTTGGGAGG,n/a
human,105369373,LOC105369373,XR_950279.2,TRCN0000165736,NM_175901.3-1946s1c1,CCTCCCTAAGTGTTGGGATTA,pLKO.1,29,3UTR,90,89,,,Y,283932,FBXL19-AS1,CCGGCCTCCCTAAGTGTTGGGATTACTCGAGTAATCCCAACACTTAGGGAGGTTTTTG,AATTCAAAAACCTCCCTAAGTGTTGGGATTACTCGAGTAATCCCAACACTTAGGGAGG,n/a
human,105369373,LOC105369373,XR_950279.2,TRCN0000166560,NM_207497.1-412s1c1,CCTCCGAAAGTGCTAGGATTA,pLKO.1,29,3UTR,90,89,,,Y,401253,LINC00336,CCGGCCTCCGAAAGTGCTAGGATTACTCGAGTAATCCTAGCACTTTCGGAGGTTTTTG,AATTCAAAAACCTCCGAAAGTGCTAGGATTACTCGAGTAATCCTAGCACTTTCGGAGG,n/a
human,105369373,LOC105369373,XR_950279.2,TRCN0000164091,NM_024795.1-1273s1c1,CCTCCTAAAGTGCTGCGATTA,pLKO.1,29,3UTR,90,89,,,Y,79853,TM4SF20,CCGGCCTCCTAAAGTGCTGCGATTACTCGAGTAATCGCAGCACTTTAGGAGGTTTTTG,AATTCAAAAACCTCCTAAAGTGCTGCGATTACTCGAGTAATCGCAGCACTTTAGGAGG,n/a
human,105369373,LOC105369373,XR_950279.2,TRCN0000140238,NM_024895.3-1807s1c1,GTCTCCCAAAGTGCTAGGATT,pLKO.1,28,3UTR,90,89,,,Y,79955,PDZD7,CCGGGTCTCCCAAAGTGCTAGGATTCTCGAGAATCCTAGCACTTTGGGAGACTTTTTG,AATTCAAAAAGTCTCCCAAAGTGCTAGGATTCTCGAGAATCCTAGCACTTTGGGAGAC,n/a
human,105369373,LOC105369373,XR_950279.2,TRCN0000129445,NM_145048.2-1500s1c1,GACTTCCAAAGTGCTGGGATT,pLKO.1,28,3UTR,90,89,,,Y,133015,PACRGL,CCGGGACTTCCAAAGTGCTGGGATTCTCGAGAATCCCAGCACTTTGGAAGTCTTTTTG,AATTCAAAAAGACTTCCAAAGTGCTGGGATTCTCGAGAATCCCAGCACTTTGGAAGTC,n/a
human,105369373,LOC105369373,XR_950279.2,TRCN0000140759,NM_018265.1-3067s1c1,GCCTTTCAAAGTGCTGGGATT,pLKO.1,28,3UTR,90,89,,,Y,55765,INAVA,CCGGGCCTTTCAAAGTGCTGGGATTCTCGAGAATCCCAGCACTTTGAAAGGCTTTTTG,AATTCAAAAAGCCTTTCAAAGTGCTGGGATTCTCGAGAATCCCAGCACTTTGAAAGGC,n/a
human,105369373,LOC105369373,XR_950279.2,TRCN0000155070,NM_017873.2-2761s1c1,GCCTTTCAAAGTGCTGGGATT,pLKO.1,28,3UTR,90,89,,,Y,140459,ASB6,CCGGGCCTTTCAAAGTGCTGGGATTCTCGAGAATCCCAGCACTTTGAAAGGCTTTTTG,AATTCAAAAAGCCTTTCAAAGTGCTGGGATTCTCGAGAATCCCAGCACTTTGAAAGGC,n/a
human,105369373,LOC105369373,XR_950279.2,TRCN0000165025,NM_207497.1-421s1c1,GTGCTAGGATTATAGGCGTGA,pLKO.1,38,3UTR,90,89,,,Y,401253,LINC00336,CCGGGTGCTAGGATTATAGGCGTGACTCGAGTCACGCCTATAATCCTAGCACTTTTTG,AATTCAAAAAGTGCTAGGATTATAGGCGTGACTCGAGTCACGCCTATAATCCTAGCAC,n/a
human,105369373,LOC105369373,XR_950279.2,TRCN0000163829,NM_173639.1-1102s1c1,CCTCCCAAATTACTGGGATTA,pLKO.1,29,3UTR,90,89,,,Y,284618,RUSC1-AS1,CCGGCCTCCCAAATTACTGGGATTACTCGAGTAATCCCAGTAATTTGGGAGGTTTTTG,AATTCAAAAACCTCCCAAATTACTGGGATTACTCGAGTAATCCCAGTAATTTGGGAGG,n/a
human,105369373,LOC105369373,XR_950279.2,TRCN0000057398,NM_002261.1-793s1c1,CCTCCCAAGTTGCTGGGATTA,pLKO.1,29,3UTR,90,89,,,Y,3823,KLRC3,CCGGCCTCCCAAGTTGCTGGGATTACTCGAGTAATCCCAGCAACTTGGGAGGTTTTTG,AATTCAAAAACCTCCCAAGTTGCTGGGATTACTCGAGTAATCCCAGCAACTTGGGAGG,n/a
human,105369373,LOC105369373,XR_950279.2,TRCN0000140374,NM_025042.2-1098s1c1,GCTTCCCAAAGTACTGGGATT,pLKO.1,28,3UTR,90,89,,,Y,,,CCGGGCTTCCCAAAGTACTGGGATTCTCGAGAATCCCAGTACTTTGGGAAGCTTTTTG,AATTCAAAAAGCTTCCCAAAGTACTGGGATTCTCGAGAATCCCAGTACTTTGGGAAGC,n/a
human,105369373,LOC105369373,XR_950279.2,TRCN0000218015,NM_000958.2-2369s21c1,ATCCAGAGCTTTGTCGTATTT,pLKO_005,587,3UTR,85,89,,,Y,5734,PTGER4,CCGGATCCAGAGCTTTGTCGTATTTCTCGAGAAATACGACAAAGCTCTGGATTTTTTG,AATTCAAAAAATCCAGAGCTTTGTCGTATTTCTCGAGAAATACGACAAAGCTCTGGAT,n/a
human,105369373,LOC105369373,XR_950279.2,TRCN0000430348,NM_024726.3-3045s21c1,TTAGTAAGCAATGAGTATATC,pLKO_005,117,3UTR,85,89,,,Y,79781,IQCA1,CCGGTTAGTAAGCAATGAGTATATCCTCGAGGATATACTCATTGCTTACTAATTTTTG,AATTCAAAAATTAGTAAGCAATGAGTATATCCTCGAGGATATACTCATTGCTTACTAA,n/a
human,105369373,LOC105369373,XR_950279.2,TRCN0000420058,NM_023074.2-1254s21c1,AGAAGGGCAATCTCAACATAC,pLKO_005,365,3UTR,85,89,,,Y,65251,ZNF649,CCGGAGAAGGGCAATCTCAACATACCTCGAGGTATGTTGAGATTGCCCTTCTTTTTTG,AATTCAAAAAAGAAGGGCAATCTCAACATACCTCGAGGTATGTTGAGATTGCCCTTCT,n/a
human,105369373,LOC105369373,XR_950279.2,TRCN0000152674,NM_053016.1-110s1c1,GCAGACTGAAATAGAAGGCAA,pLKO.1,742,3UTR,85,89,,,Y,,,CCGGGCAGACTGAAATAGAAGGCAACTCGAGTTGCCTTCTATTTCAGTCTGCTTTTTG,AATTCAAAAAGCAGACTGAAATAGAAGGCAACTCGAGTTGCCTTCTATTTCAGTCTGC,n/a
human,105369373,LOC105369373,XR_950279.2,TRCN0000253168,NM_207213.1-313s21c1,TACAGTTACAGAGACTATATT,pLKO_005,281,3UTR,85,89,,,Y,102141,Snx25,CCGGTACAGTTACAGAGACTATATTCTCGAGAATATAGTCTCTGTAACTGTATTTTTG,AATTCAAAAATACAGTTACAGAGACTATATTCTCGAGAATATAGTCTCTGTAACTGTA,n/a
human,105369373,LOC105369373,XR_950279.2,TRCN0000175821,NM_027269.2-1678s1c1,GCTGAGATTAAAGGCCAAAGT,pLKO.1,745,3UTR,85,89,,,Y,109065,Dnaaf2,CCGGGCTGAGATTAAAGGCCAAAGTCTCGAGACTTTGGCCTTTAATCTCAGCTTTTTG,AATTCAAAAAGCTGAGATTAAAGGCCAAAGTCTCGAGACTTTGGCCTTTAATCTCAGC,n/a
human,105369373,LOC105369373,XR_950279.2,TRCN0000149571,NM_003296.1-854s1c1,GCCAGTATCAAGATCTCCTAA,pLKO.1,327,3UTR,80,89,,,Y,7180,CRISP2,CCGGGCCAGTATCAAGATCTCCTAACTCGAGTTAGGAGATCTTGATACTGGCTTTTTG,AATTCAAAAAGCCAGTATCAAGATCTCCTAACTCGAGTTAGGAGATCTTGATACTGGC,n/a
human,105369373,LOC105369373,XR_950279.2,TRCN0000165087,NM_018144.2-1666s1c1,GCTAAGTCTGTGTGCAGCATT,pLKO.1,347,3UTR,80,89,,,Y,55176,SEC61A2,CCGGGCTAAGTCTGTGTGCAGCATTCTCGAGAATGCTGCACACAGACTTAGCTTTTTG,AATTCAAAAAGCTAAGTCTGTGTGCAGCATTCTCGAGAATGCTGCACACAGACTTAGC,n/a
human,105369373,LOC105369373,XR_950279.2,TRCN0000125903,NM_175564.2-402s1c1,TCAGATAATGAGAAGACGGAT,pLKO.1,245,3UTR,80,89,,,Y,271711,Tmem169,CCGGTCAGATAATGAGAAGACGGATCTCGAGATCCGTCTTCTCATTATCTGATTTTTG,AATTCAAAAATCAGATAATGAGAAGACGGATCTCGAGATCCGTCTTCTCATTATCTGA,n/a
human,105369373,LOC105369373,XR_950279.2,TRCN0000155483,NM_015179.2-3768s1c1,GCTGAATACAAGGCCAAGAAA,pLKO.1,745,3UTR,81,85,,,Y,23223,RRP12,CCGGGCTGAATACAAGGCCAAGAAACTCGAGTTTCTTGGCCTTGTATTCAGCTTTTTG,AATTCAAAAAGCTGAATACAAGGCCAAGAAACTCGAGTTTCTTGGCCTTGTATTCAGC,n/a
human,105369373,LOC105369373,XR_950279.2,TRCN0000002061,NM_015292.x-1200s1c1,GAGACTTATGAGGTGATGGTA,pLKO.1,558,3UTR,81,85,,,Y,23344,ESYT1,CCGGGAGACTTATGAGGTGATGGTACTCGAGTACCATCACCTCATAAGTCTCTTTTTG,AATTCAAAAAGAGACTTATGAGGTGATGGTACTCGAGTACCATCACCTCATAAGTCTC,n/a
