Taxon,"Gene ID","Gene Symbol",Transcript,"Clone ID","Legacy Clone Name","Target Seq",Vector,"Match Position","Match Region","Match %","SDR Match %","Intrinsic Score","Adjusted Score","Matches Other Gene in Same Taxon?","Orig. Target Gene ID","Orig. Target Gene Symbol","Forward Oligo Sequence","Reverse Oligo Sequence",Addgene
human,101929774,LOC101929774,XR_951561.3,TRCN0000344481,NM_001039083.3-582s21c1,AGCAGCGGTTTCCCAAGTTTC,pLKO_005,36,3UTR,100,100,10.8,5.4,Y,100506084,ARL17B,CCGGAGCAGCGGTTTCCCAAGTTTCCTCGAGGAAACTTGGGAAACCGCTGCTTTTTTG,AATTCAAAAAAGCAGCGGTTTCCCAAGTTTCCTCGAGGAAACTTGGGAAACCGCTGCT,n/a
human,101929774,LOC101929774,XR_951561.3,TRCN0000139147,NM_016632.1-447s1c1,CCCATCTCTTGGACAGATGAT,pLKO.1,288,3UTR,100,100,.495,.2475,Y,51326,ARL17A,CCGGCCCATCTCTTGGACAGATGATCTCGAGATCATCTGTCCAAGAGATGGGTTTTTG,AATTCAAAAACCCATCTCTTGGACAGATGATCTCGAGATCATCTGTCCAAGAGATGGG,n/a
human,101929774,LOC101929774,XR_951561.3,TRCN0000166030,NM_005821.2-472s1c1,CCTCTGGAAATCAGCTGTGTT,pLKO.1,71,3UTR,90,100,4.95,2.475,Y,10230,NBR2,CCGGCCTCTGGAAATCAGCTGTGTTCTCGAGAACACAGCTGATTTCCAGAGGTTTTTG,AATTCAAAAACCTCTGGAAATCAGCTGTGTTCTCGAGAACACAGCTGATTTCCAGAGG,n/a
human,101929774,LOC101929774,XR_951561.3,TRCN0000428035,NM_026620.3-390s21c1,AGTACAGAACTTCAAGCTTTA,pLKO_005,389,3UTR,85,89,,,Y,68215,Fam98b,CCGGAGTACAGAACTTCAAGCTTTACTCGAGTAAAGCTTGAAGTTCTGTACTTTTTTG,AATTCAAAAAAGTACAGAACTTCAAGCTTTACTCGAGTAAAGCTTGAAGTTCTGTACT,n/a
human,101929774,LOC101929774,XR_951561.3,TRCN0000107313,NM_173539.1-259s1c1,CTCTGCAAATCAGTTGTGCTT,pLKO.1,72,3UTR,80,89,,,Y,169270,ZNF596,CCGGCTCTGCAAATCAGTTGTGCTTCTCGAGAAGCACAACTGATTTGCAGAGTTTTTG,AATTCAAAAACTCTGCAAATCAGTTGTGCTTCTCGAGAAGCACAACTGATTTGCAGAG,n/a
human,101929774,LOC101929774,XR_951561.3,TRCN0000135426,NM_024697.1-759s1c1,GCAGAAATCTGTAACTGCCAA,pLKO.1,145,3UTR,80,89,,,Y,79750,ZNF385D,CCGGGCAGAAATCTGTAACTGCCAACTCGAGTTGGCAGTTACAGATTTCTGCTTTTTG,AATTCAAAAAGCAGAAATCTGTAACTGCCAACTCGAGTTGGCAGTTACAGATTTCTGC,n/a
human,101929774,LOC101929774,XR_951561.3,TRCN0000190111,NM_001009952.1-159s1c1,CTCCAGGCATTCAATGCTACT,pLKO.1,553,3UTR,80,89,,,Y,494519,Scgb2b20,CCGGCTCCAGGCATTCAATGCTACTCTCGAGAGTAGCATTGAATGCCTGGAGTTTTTG,AATTCAAAAACTCCAGGCATTCAATGCTACTCTCGAGAGTAGCATTGAATGCCTGGAG,n/a
human,101929774,LOC101929774,XR_951561.3,TRCN0000373521,NM_205854.2-160s21c1,ACTGAAGCTGAAGGAGTCTTT,pLKO_005,463,3UTR,81,85,,,Y,389376,SFTA2,CCGGACTGAAGCTGAAGGAGTCTTTCTCGAGAAAGACTCCTTCAGCTTCAGTTTTTTG,AATTCAAAAAACTGAAGCTGAAGGAGTCTTTCTCGAGAAAGACTCCTTCAGCTTCAGT,n/a
human,101929774,LOC101929774,XR_951561.3,TRCN0000131011,NM_176811.2-3346s1c1,CCACAGAACCTCAGCTTTGAA,pLKO.1,390,3UTR,77,85,,,Y,126205,NLRP8,CCGGCCACAGAACCTCAGCTTTGAACTCGAGTTCAAAGCTGAGGTTCTGTGGTTTTTG,AATTCAAAAACCACAGAACCTCAGCTTTGAACTCGAGTTCAAAGCTGAGGTTCTGTGG,n/a
human,101929774,LOC101929774,XR_951561.3,TRCN0000032790,XM_125854.2-692s1c1,GCTGAAGGAACTCAGCAGAAA,pLKO.1,22,3UTR,77,85,,,Y,71761,Amdhd1,CCGGGCTGAAGGAACTCAGCAGAAACTCGAGTTTCTGCTGAGTTCCTTCAGCTTTTTG,AATTCAAAAAGCTGAAGGAACTCAGCAGAAACTCGAGTTTCTGCTGAGTTCCTTCAGC,n/a
human,101929774,LOC101929774,XR_951561.3,TRCN0000229441,NM_008228.2-1492s21c1,CCCAAGTTCCTCACTTCTCAG,pLKO_005,47,3UTR,77,85,,,Y,433759,Hdac1,CCGGCCCAAGTTCCTCACTTCTCAGCTCGAGCTGAGAAGTGAGGAACTTGGGTTTTTG,AATTCAAAAACCCAAGTTCCTCACTTCTCAGCTCGAGCTGAGAAGTGAGGAACTTGGG,n/a
