Taxon,"Gene ID","Gene Symbol",Transcript,"Clone ID","Legacy Clone Name","Target Seq",Vector,"Match Position","Match Region","Match %","SDR Match %","Intrinsic Score","Adjusted Score","Matches Other Gene in Same Taxon?","Orig. Target Gene ID","Orig. Target Gene Symbol","Forward Oligo Sequence","Reverse Oligo Sequence",Addgene
human,57623,ZFAT,NM_001029939.4,TRCN0000148619,NM_020863.2-4450s1c1,CCTTGGTATCAAGTGAGGTAA,pLKO.1,4540,3UTR,100,100,4.95,6.93,N,57623,ZFAT,CCGGCCTTGGTATCAAGTGAGGTAACTCGAGTTACCTCACTTGATACCAAGGTTTTTG,AATTCAAAAACCTTGGTATCAAGTGAGGTAACTCGAGTTACCTCACTTGATACCAAGG,n/a
human,57623,ZFAT,NM_001029939.4,TRCN0000148980,NM_020863.2-2535s1c1,GCCACGTAATTCAGAAACACA,pLKO.1,2625,CDS,100,100,3,4.2,N,57623,ZFAT,CCGGGCCACGTAATTCAGAAACACACTCGAGTGTGTTTCTGAATTACGTGGCTTTTTG,AATTCAAAAAGCCACGTAATTCAGAAACACACTCGAGTGTGTTTCTGAATTACGTGGC,n/a
human,57623,ZFAT,NM_001029939.4,TRCN0000131174,NM_020863.2-917s1c1,GCCATTCAGCAGACACCTTAT,pLKO.1,1007,CDS,100,100,10.8,8.64,N,57623,ZFAT,CCGGGCCATTCAGCAGACACCTTATCTCGAGATAAGGTGTCTGCTGAATGGCTTTTTG,AATTCAAAAAGCCATTCAGCAGACACCTTATCTCGAGATAAGGTGTCTGCTGAATGGC,n/a
human,57623,ZFAT,NM_001029939.4,TRCN0000148961,NM_020863.2-3327s1c1,GCACCAAATGGGAGTTCAATA,pLKO.1,3417,CDS,100,100,13.2,9.24,N,57623,ZFAT,CCGGGCACCAAATGGGAGTTCAATACTCGAGTATTGAACTCCCATTTGGTGCTTTTTG,AATTCAAAAAGCACCAAATGGGAGTTCAATACTCGAGTATTGAACTCCCATTTGGTGC,n/a
human,57623,ZFAT,NM_001029939.4,TRCN0000150021,NM_020863.2-1003s1c1,CAACAAGGTCTTCAAGTTCAA,pLKO.1,1093,CDS,100,100,4.95,3.465,N,57623,ZFAT,CCGGCAACAAGGTCTTCAAGTTCAACTCGAGTTGAACTTGAAGACCTTGTTGTTTTTG,AATTCAAAAACAACAAGGTCTTCAAGTTCAACTCGAGTTGAACTTGAAGACCTTGTTG,n/a
human,57623,ZFAT,NM_001029939.4,TRCN0000147064,NM_020863.2-988s1c1,CACTTGTGAATACTGCAACAA,pLKO.1,1078,CDS,100,100,4.95,3.465,N,57623,ZFAT,CCGGCACTTGTGAATACTGCAACAACTCGAGTTGTTGCAGTATTCACAAGTGTTTTTG,AATTCAAAAACACTTGTGAATACTGCAACAACTCGAGTTGTTGCAGTATTCACAAGTG,n/a
human,57623,ZFAT,NM_001029939.4,TRCN0000148788,NM_020863.2-577s1c1,CATCTGCATTATCGTGCTGAA,pLKO.1,667,CDS,100,100,4.05,2.835,N,57623,ZFAT,CCGGCATCTGCATTATCGTGCTGAACTCGAGTTCAGCACGATAATGCAGATGTTTTTG,AATTCAAAAACATCTGCATTATCGTGCTGAACTCGAGTTCAGCACGATAATGCAGATG,n/a
human,57623,ZFAT,NM_001029939.4,TRCN0000129521,NM_020863.2-1219s1c1,GCACAAGAAGATCAAGCAGCA,pLKO.1,1309,CDS,100,100,2.16,1.512,N,57623,ZFAT,CCGGGCACAAGAAGATCAAGCAGCACTCGAGTGCTGCTTGATCTTCTTGTGCTTTTTG,AATTCAAAAAGCACAAGAAGATCAAGCAGCACTCGAGTGCTGCTTGATCTTCTTGTGC,n/a
human,57623,ZFAT,NM_001029939.4,TRCN0000164295,NM_001013681.1-322s1c1,CAAAGATTGCTGCCTGTTCTT,pLKO.1,200,5UTR,95,100,4.95,2.475,Y,,,CCGGCAAAGATTGCTGCCTGTTCTTCTCGAGAAGAACAGGCAGCAATCTTTGTTTTTG,AATTCAAAAACAAAGATTGCTGCCTGTTCTTCTCGAGAAGAACAGGCAGCAATCTTTG,n/a
