Taxon,"Gene ID","Gene Symbol",Transcript,"Clone ID","Legacy Clone Name","Target Seq",Vector,"Match Position","Match Region","Match %","SDR Match %","Intrinsic Score","Adjusted Score","Matches Other Gene in Same Taxon?","Orig. Target Gene ID","Orig. Target Gene Symbol","Forward Oligo Sequence","Reverse Oligo Sequence",Addgene
human,388165,UBE2Q2P1,NR_003661.2,TRCN0000118492,NM_207382.1-1794s1c1,CGTAAGTAGATGGCTCTCTTA,pLKO.1,1794,3UTR,100,100,4.95,3.465,N,388165,UBE2Q2P1,CCGGCGTAAGTAGATGGCTCTCTTACTCGAGTAAGAGAGCCATCTACTTACGTTTTTG,AATTCAAAAACGTAAGTAGATGGCTCTCTTACTCGAGTAAGAGAGCCATCTACTTACG,n/a
human,388165,UBE2Q2P1,NR_003661.2,TRCN0000118493,NM_207382.1-1479s1c1,AGATGAAAGAAGAGCCTACTA,pLKO.1,1479,3UTR,100,100,4.95,2.97,N,388165,UBE2Q2P1,CCGGAGATGAAAGAAGAGCCTACTACTCGAGTAGTAGGCTCTTCTTTCATCTTTTTTG,AATTCAAAAAAGATGAAAGAAGAGCCTACTACTCGAGTAGTAGGCTCTTCTTTCATCT,n/a
human,388165,UBE2Q2P1,NR_003661.2,TRCN0000040646,NM_180600.1-591s1c1,GCAGATTATATAACCTTCCTA,pLKO.1,1329,3UTR,100,100,3,1.8,N,109161,Ube2q2,CCGGGCAGATTATATAACCTTCCTACTCGAGTAGGAAGGTTATATAATCTGCTTTTTG,AATTCAAAAAGCAGATTATATAACCTTCCTACTCGAGTAGGAAGGTTATATAATCTGC,n/a
human,388165,UBE2Q2P1,NR_003661.2,TRCN0000118496,NM_207382.1-1489s1c1,AGAGCCTACTAGTGAGAAGAA,pLKO.1,1489,3UTR,100,100,0,0,N,388165,UBE2Q2P1,CCGGAGAGCCTACTAGTGAGAAGAACTCGAGTTCTTCTCACTAGTAGGCTCTTTTTTG,AATTCAAAAAAGAGCCTACTAGTGAGAAGAACTCGAGTTCTTCTCACTAGTAGGCTCT,n/a
human,388165,UBE2Q2P1,NR_003661.2,TRCN0000118494,NM_207382.1-1492s1c1,GCCTACTAGTGAGAAGAAGTT,pLKO.1,1492,3UTR,100,100,0,0,N,388165,UBE2Q2P1,CCGGGCCTACTAGTGAGAAGAAGTTCTCGAGAACTTCTTCTCACTAGTAGGCTTTTTG,AATTCAAAAAGCCTACTAGTGAGAAGAAGTTCTCGAGAACTTCTTCTCACTAGTAGGC,n/a
human,388165,UBE2Q2P1,NR_003661.2,TRCN0000118495,NM_207382.1-1135s1c1,TGTTCAGCCAATCGTGTTTAA,pLKO.1,1135,3UTR,100,100,13.2,6.6,Y,388165,UBE2Q2P1,CCGGTGTTCAGCCAATCGTGTTTAACTCGAGTTAAACACGATTGGCTGAACATTTTTG,AATTCAAAAATGTTCAGCCAATCGTGTTTAACTCGAGTTAAACACGATTGGCTGAACA,n/a
human,388165,UBE2Q2P1,NR_003661.2,TRCN0000165534,NM_001012717.1-362s1c1,GAGACAGGGTTTCACCATGTT,pLKO.1,966,3UTR,100,100,4.95,2.475,Y,,,CCGGGAGACAGGGTTTCACCATGTTCTCGAGAACATGGTGAAACCCTGTCTCTTTTTG,AATTCAAAAAGAGACAGGGTTTCACCATGTTCTCGAGAACATGGTGAAACCCTGTCTC,n/a
human,388165,UBE2Q2P1,NR_003661.2,TRCN0000138140,NM_001013716.1-916s1c1,GATTGAGACCATCCTGGCTAA,pLKO.1,1942,3UTR,100,100,4.05,2.025,Y,441087,LOC441087,CCGGGATTGAGACCATCCTGGCTAACTCGAGTTAGCCAGGATGGTCTCAATCTTTTTG,AATTCAAAAAGATTGAGACCATCCTGGCTAACTCGAGTTAGCCAGGATGGTCTCAATC,n/a
