Taxon,"Gene ID","Gene Symbol",Transcript,"Clone ID","Legacy Clone Name","Target Seq",Vector,"Match Position","Match Region","Match %","SDR Match %","Intrinsic Score","Adjusted Score","Matches Other Gene in Same Taxon?","Orig. Target Gene ID","Orig. Target Gene Symbol","Forward Oligo Sequence","Reverse Oligo Sequence",Addgene
human,7404,UTY,XM_011531464.3,TRCN0000229955,NM_007125.3-2862s21c1,GGCAACTAGCACTGGTATTAA,pLKO_005,2347,CDS,100,100,15,21,N,7404,UTY,CCGGGGCAACTAGCACTGGTATTAACTCGAGTTAATACCAGTGCTAGTTGCCTTTTTG,AATTCAAAAAGGCAACTAGCACTGGTATTAACTCGAGTTAATACCAGTGCTAGTTGCC,n/a
human,7404,UTY,XM_011531464.3,TRCN0000108116,NM_007125.3-2298s1c1,GCGAGCAAATAGAGATAATTT,pLKO.1,1783,CDS,100,100,15,12,N,7404,UTY,CCGGGCGAGCAAATAGAGATAATTTCTCGAGAAATTATCTCTATTTGCTCGCTTTTTG,AATTCAAAAAGCGAGCAAATAGAGATAATTTCTCGAGAAATTATCTCTATTTGCTCGC,n/a
human,7404,UTY,XM_011531464.3,TRCN0000108117,NM_007125.3-2633s1c1,GCAGTAATTGTATAGCAGGAA,pLKO.1,2118,CDS,100,100,2.64,1.848,N,7404,UTY,CCGGGCAGTAATTGTATAGCAGGAACTCGAGTTCCTGCTATACAATTACTGCTTTTTG,AATTCAAAAAGCAGTAATTGTATAGCAGGAACTCGAGTTCCTGCTATACAATTACTGC,n/a
human,7404,UTY,XM_011531464.3,TRCN0000218022,NM_007125.3-2001s21c1,GGATGCTTTACAGGCATATAT,pLKO_005,1351,CDS,100,100,15,9,N,7404,UTY,CCGGGGATGCTTTACAGGCATATATCTCGAGATATATGCCTGTAAAGCATCCTTTTTG,AATTCAAAAAGGATGCTTTACAGGCATATATCTCGAGATATATGCCTGTAAAGCATCC,n/a
human,7404,UTY,XM_011531464.3,TRCN0000229956,NM_007125.3-3657s21c1,TCCACCCACACCTAGTATTTA,pLKO_005,3142,CDS,100,100,15,9,N,7404,UTY,CCGGTCCACCCACACCTAGTATTTACTCGAGTAAATACTAGGTGTGGGTGGATTTTTG,AATTCAAAAATCCACCCACACCTAGTATTTACTCGAGTAAATACTAGGTGTGGGTGGA,n/a
human,7404,UTY,XM_011531464.3,TRCN0000165534,NM_001012717.1-362s1c1,GAGACAGGGTTTCACCATGTT,pLKO.1,3614,CDS,100,100,4.95,2.475,Y,,,CCGGGAGACAGGGTTTCACCATGTTCTCGAGAACATGGTGAAACCCTGTCTCTTTTTG,AATTCAAAAAGAGACAGGGTTTCACCATGTTCTCGAGAACATGGTGAAACCCTGTCTC,n/a
human,7404,UTY,XM_011531464.3,TRCN0000155836,NM_198582.1-3275s1c1,CCCAAAGTGCTGGGATTACAA,pLKO.1,3687,CDS,95,100,5.625,2.8125,Y,377007,KLHL30,CCGGCCCAAAGTGCTGGGATTACAACTCGAGTTGTAATCCCAGCACTTTGGGTTTTTG,AATTCAAAAACCCAAAGTGCTGGGATTACAACTCGAGTTGTAATCCCAGCACTTTGGG,n/a
human,7404,UTY,XM_011531464.3,TRCN0000141025,NM_152361.1-835s1c1,CCCAAAGTGCTGGGATTACTT,pLKO.1,3687,CDS,90,100,5.625,2.8125,Y,126272,EID2B,CCGGCCCAAAGTGCTGGGATTACTTCTCGAGAAGTAATCCCAGCACTTTGGGTTTTTG,AATTCAAAAACCCAAAGTGCTGGGATTACTTCTCGAGAAGTAATCCCAGCACTTTGGG,n/a
