Taxon,"Gene ID","Gene Symbol",Transcript,"Clone ID","Legacy Clone Name","Target Seq",Vector,"Match Position","Match Region","Match %","SDR Match %","Intrinsic Score","Adjusted Score","Matches Other Gene in Same Taxon?","Orig. Target Gene ID","Orig. Target Gene Symbol","Forward Oligo Sequence","Reverse Oligo Sequence",Addgene
human,2065,ERBB3,NM_001005915.1,TRCN0000194972,NM_001982.2-544s1c1,CTTCGTCATGTTGAACTATAA,pLKO.1,544,CDS,100,100,13.2,18.48,N,2065,ERBB3,CCGGCTTCGTCATGTTGAACTATAACTCGAGTTATAGTTCAACATGACGAAGTTTTTG,AATTCAAAAACTTCGTCATGTTGAACTATAACTCGAGTTATAGTTCAACATGACGAAG,n/a
human,2065,ERBB3,NM_001005915.1,TRCN0000230091,NM_001982.2-545s21c1,TTCGTCATGTTGAACTATAAC,pLKO_005,545,CDS,100,100,13.2,18.48,N,2065,ERBB3,CCGGTTCGTCATGTTGAACTATAACCTCGAGGTTATAGTTCAACATGACGAATTTTTG,AATTCAAAAATTCGTCATGTTGAACTATAACCTCGAGGTTATAGTTCAACATGACGAA,n/a
human,2065,ERBB3,NM_001005915.1,TRCN0000010344,NM_001982.x-475s1c1,GAATTCTCTACTCTACCATTG,pLKO.1,470,CDS,100,100,0,0,N,2065,ERBB3,CCGGGAATTCTCTACTCTACCATTGCTCGAGCAATGGTAGAGTAGAGAATTCTTTTTG,AATTCAAAAAGAATTCTCTACTCTACCATTGCTCGAGCAATGGTAGAGTAGAGAATTC,n/a
human,2065,ERBB3,NM_001005915.1,TRCN0000159231,NM_152363.2-2499s1c1,CGAAACCCTATCTCTACTAAA,pLKO.1,998,3UTR,95,95,,,Y,126549,ANKLE1,CCGGCGAAACCCTATCTCTACTAAACTCGAGTTTAGTAGAGATAGGGTTTCGTTTTTG,AATTCAAAAACGAAACCCTATCTCTACTAAACTCGAGTTTAGTAGAGATAGGGTTTCG,n/a
human,2065,ERBB3,NM_001005915.1,TRCN0000242826,NM_025069.1-1303s21c1,CCTCCTTCCTGCAGGGATTAT,pLKO_005,414,CDS,81,90,,,Y,80139,ZNF703,CCGGCCTCCTTCCTGCAGGGATTATCTCGAGATAATCCCTGCAGGAAGGAGGTTTTTG,AATTCAAAAACCTCCTTCCTGCAGGGATTATCTCGAGATAATCCCTGCAGGAAGGAGG,n/a
human,2065,ERBB3,NM_001005915.1,TRCN0000162655,NM_138368.2-3984s1c1,CGAAACCCTGTGTCTAATAAA,pLKO.1,998,3UTR,90,89,,,Y,91056,AP5B1,CCGGCGAAACCCTGTGTCTAATAAACTCGAGTTTATTAGACACAGGGTTTCGTTTTTG,AATTCAAAAACGAAACCCTGTGTCTAATAAACTCGAGTTTATTAGACACAGGGTTTCG,n/a
human,2065,ERBB3,NM_001005915.1,TRCN0000138243,NM_001018116.1-2447s1c1,CGAAACCCTGACTCTACTGAA,pLKO.1,998,3UTR,90,89,,,Y,347273,CAVIN4,CCGGCGAAACCCTGACTCTACTGAACTCGAGTTCAGTAGAGTCAGGGTTTCGTTTTTG,AATTCAAAAACGAAACCCTGACTCTACTGAACTCGAGTTCAGTAGAGTCAGGGTTTCG,n/a
human,2065,ERBB3,NM_001005915.1,TRCN0000112774,NM_020016.1-848s1c1,GCCCAAGACAGGTATCCTCAT,pLKO.1,656,CDS,85,89,,,Y,17138,Magea2,CCGGGCCCAAGACAGGTATCCTCATCTCGAGATGAGGATACCTGTCTTGGGCTTTTTG,AATTCAAAAAGCCCAAGACAGGTATCCTCATCTCGAGATGAGGATACCTGTCTTGGGC,n/a
human,2065,ERBB3,NM_001005915.1,TRCN0000095480,NM_177362.2-187s1c1,GAGAAGTATGAGGTGGTGAAA,pLKO.1,353,CDS,80,89,,,Y,244216,Zfp771,CCGGGAGAAGTATGAGGTGGTGAAACTCGAGTTTCACCACCTCATACTTCTCTTTTTG,AATTCAAAAAGAGAAGTATGAGGTGGTGAAACTCGAGTTTCACCACCTCATACTTCTC,n/a
human,2065,ERBB3,NM_001005915.1,TRCN0000161513,NM_147200.1-260s1c1,GCTGAAACCAATCCCAGAATA,pLKO.1,317,CDS,77,85,,,Y,10758,TRAF3IP2,CCGGGCTGAAACCAATCCCAGAATACTCGAGTATTCTGGGATTGGTTTCAGCTTTTTG,AATTCAAAAAGCTGAAACCAATCCCAGAATACTCGAGTATTCTGGGATTGGTTTCAGC,n/a
human,2065,ERBB3,NM_001005915.1,TRCN0000204704,NM_146954.1-247s1c1,GCTCTGATTGGCCTAGTGTTT,pLKO.1,287,CDS,77,85,,,Y,258956,Olfr535,CCGGGCTCTGATTGGCCTAGTGTTTCTCGAGAAACACTAGGCCAATCAGAGCTTTTTG,AATTCAAAAAGCTCTGATTGGCCTAGTGTTTCTCGAGAAACACTAGGCCAATCAGAGC,n/a
