Taxon,"Gene ID","Gene Symbol",Transcript,"Clone ID","Legacy Clone Name","Target Seq",Vector,"Match Position","Match Region","Match %","SDR Match %","Intrinsic Score","Adjusted Score","Matches Other Gene in Same Taxon?","Orig. Target Gene ID","Orig. Target Gene Symbol","Forward Oligo Sequence","Reverse Oligo Sequence",Addgene
human,1728,NQO1,NM_001025434.2,TRCN0000320909,NM_000903.2-1189s21c1,GATTACTATCATGGCATATAA,pLKO_005,1005,3UTR,100,100,15,21,N,1728,NQO1,CCGGGATTACTATCATGGCATATAACTCGAGTTATATGCCATGATAGTAATCTTTTTG,AATTCAAAAAGATTACTATCATGGCATATAACTCGAGTTATATGCCATGATAGTAATC,n/a
human,1728,NQO1,NM_001025434.2,TRCN0000003770,NM_000903.x-903s1c1,CATGTTATCAAATCTGGGTAT,pLKO.1,860,3UTR,100,100,4.05,5.67,N,1728,NQO1,CCGGCATGTTATCAAATCTGGGTATCTCGAGATACCCAGATTTGATAACATGTTTTTG,AATTCAAAAACATGTTATCAAATCTGGGTATCTCGAGATACCCAGATTTGATAACATG,n/a
human,1728,NQO1,NM_001025434.2,TRCN0000350362,NM_000903.2-401s21c1,CGAGTCTGTTCTGGCTTATAA,pLKO_005,331,CDS,100,100,15,10.5,N,1728,NQO1,CCGGCGAGTCTGTTCTGGCTTATAACTCGAGTTATAAGCCAGAACAGACTCGTTTTTG,AATTCAAAAACGAGTCTGTTCTGGCTTATAACTCGAGTTATAAGCCAGAACAGACTCG,n/a
human,1728,NQO1,NM_001025434.2,TRCN0000003766,NM_000903.x-207s1c1,AGAAAGGACATCACAGGTAAA,pLKO.1,278,CDS,100,100,10.8,7.56,N,1728,NQO1,CCGGAGAAAGGACATCACAGGTAAACTCGAGTTTACCTGTGATGTCCTTTCTTTTTTG,AATTCAAAAAAGAAAGGACATCACAGGTAAACTCGAGTTTACCTGTGATGTCCTTTCT,n/a
human,1728,NQO1,NM_001025434.2,TRCN0000003768,NM_000903.x-672s1c1,TGGAAGAAACGCCTGGAGAAT,pLKO.1,629,CDS,100,100,4.95,3.465,N,1728,NQO1,CCGGTGGAAGAAACGCCTGGAGAATCTCGAGATTCTCCAGGCGTTTCTTCCATTTTTG,AATTCAAAAATGGAAGAAACGCCTGGAGAATCTCGAGATTCTCCAGGCGTTTCTTCCA,n/a
human,1728,NQO1,NM_001025434.2,TRCN0000350361,NM_000903.2-813s21c1,TGGAAGAAACGCCTGGAGAAT,pLKO_005,629,CDS,100,100,4.95,3.465,N,1728,NQO1,CCGGTGGAAGAAACGCCTGGAGAATCTCGAGATTCTCCAGGCGTTTCTTCCATTTTTG,AATTCAAAAATGGAAGAAACGCCTGGAGAATCTCGAGATTCTCCAGGCGTTTCTTCCA,n/a
human,1728,NQO1,NM_001025434.2,TRCN0000155836,NM_198582.1-3275s1c1,CCCAAAGTGCTGGGATTACAA,pLKO.1,1715,3UTR,95,100,5.625,2.8125,Y,377007,KLHL30,CCGGCCCAAAGTGCTGGGATTACAACTCGAGTTGTAATCCCAGCACTTTGGGTTTTTG,AATTCAAAAACCCAAAGTGCTGGGATTACAACTCGAGTTGTAATCCCAGCACTTTGGG,n/a
human,1728,NQO1,NM_001025434.2,TRCN0000003769,NM_000903.x-335s1c1,AGACCTTGTGATATTCCAGTT,pLKO.1,406,CDS,90,100,4.05,2.835,N,1728,NQO1,CCGGAGACCTTGTGATATTCCAGTTCTCGAGAACTGGAATATCACAAGGTCTTTTTTG,AATTCAAAAAAGACCTTGTGATATTCCAGTTCTCGAGAACTGGAATATCACAAGGTCT,n/a
human,1728,NQO1,NM_001025434.2,TRCN0000320837,NM_000903.2-476s21c1,AGACCTTGTGATATTCCAGTT,pLKO_005,406,CDS,90,100,4.05,2.835,N,1728,NQO1,CCGGAGACCTTGTGATATTCCAGTTCTCGAGAACTGGAATATCACAAGGTCTTTTTTG,AATTCAAAAAAGACCTTGTGATATTCCAGTTCTCGAGAACTGGAATATCACAAGGTCT,n/a
human,1728,NQO1,NM_001025434.2,TRCN0000141025,NM_152361.1-835s1c1,CCCAAAGTGCTGGGATTACTT,pLKO.1,1715,3UTR,90,100,5.625,2.8125,Y,126272,EID2B,CCGGCCCAAAGTGCTGGGATTACTTCTCGAGAAGTAATCCCAGCACTTTGGGTTTTTG,AATTCAAAAACCCAAAGTGCTGGGATTACTTCTCGAGAAGTAATCCCAGCACTTTGGG,n/a
human,1728,NQO1,NM_001025434.2,TRCN0000204533,NM_001013675.1-1987s1c1,CCTCCCAAAGTGCTGGAATTA,pLKO.1,1712,3UTR,95,95,,,Y,400891,LRRC74B,CCGGCCTCCCAAAGTGCTGGAATTACTCGAGTAATTCCAGCACTTTGGGAGGTTTTTG,AATTCAAAAACCTCCCAAAGTGCTGGAATTACTCGAGTAATTCCAGCACTTTGGGAGG,n/a
human,1728,NQO1,NM_001025434.2,TRCN0000072628,NM_016065.3-1636s1c1,CCTCCCAAAGTGCTAGGATTA,pLKO.1,1712,3UTR,95,95,,,Y,51021,MRPS16,CCGGCCTCCCAAAGTGCTAGGATTACTCGAGTAATCCTAGCACTTTGGGAGGTTTTTG,AATTCAAAAACCTCCCAAAGTGCTAGGATTACTCGAGTAATCCTAGCACTTTGGGAGG,n/a
human,1728,NQO1,NM_001025434.2,TRCN0000164801,NM_016534.2-1646s1c1,CCTCCCAAAGTACTGGGATTA,pLKO.1,1712,3UTR,95,95,,,Y,51275,MAPKAPK5-AS1,CCGGCCTCCCAAAGTACTGGGATTACTCGAGTAATCCCAGTACTTTGGGAGGTTTTTG,AATTCAAAAACCTCCCAAAGTACTGGGATTACTCGAGTAATCCCAGTACTTTGGGAGG,n/a
human,1728,NQO1,NM_001025434.2,TRCN0000008902,NM_016540.2-2291s1c1,CCTCCCAAAGTGTTGGGATTA,pLKO.1,1712,3UTR,95,95,,,Y,10888,GPR83,CCGGCCTCCCAAAGTGTTGGGATTACTCGAGTAATCCCAACACTTTGGGAGGTTTTTG,AATTCAAAAACCTCCCAAAGTGTTGGGATTACTCGAGTAATCCCAACACTTTGGGAGG,n/a
human,1728,NQO1,NM_001025434.2,TRCN0000156315,NM_020702.1-3633s1c1,CCTCCCAAAGTGTTGGGATTA,pLKO.1,1712,3UTR,95,95,,,Y,57462,MYORG,CCGGCCTCCCAAAGTGTTGGGATTACTCGAGTAATCCCAACACTTTGGGAGGTTTTTG,AATTCAAAAACCTCCCAAAGTGTTGGGATTACTCGAGTAATCCCAACACTTTGGGAGG,n/a
human,1728,NQO1,NM_001025434.2,TRCN0000116227,NM_024930.1-2895s1c1,CCTCCCAAAGTTCTGGGATTA,pLKO.1,1712,3UTR,95,95,,,Y,79993,ELOVL7,CCGGCCTCCCAAAGTTCTGGGATTACTCGAGTAATCCCAGAACTTTGGGAGGTTTTTG,AATTCAAAAACCTCCCAAAGTTCTGGGATTACTCGAGTAATCCCAGAACTTTGGGAGG,n/a
human,1728,NQO1,NM_001025434.2,TRCN0000164591,NM_003281.3-2102s1c1,CCTCCCAAAGTTCTGGGATTA,pLKO.1,1712,3UTR,95,95,,,Y,7135,TNNI1,CCGGCCTCCCAAAGTTCTGGGATTACTCGAGTAATCCCAGAACTTTGGGAGGTTTTTG,AATTCAAAAACCTCCCAAAGTTCTGGGATTACTCGAGTAATCCCAGAACTTTGGGAGG,n/a
human,1728,NQO1,NM_001025434.2,TRCN0000040213,NM_000618.2-6169s1c1,CCTCCCAAATTGCTGGGATTA,pLKO.1,1712,3UTR,95,95,,,Y,3479,IGF1,CCGGCCTCCCAAATTGCTGGGATTACTCGAGTAATCCCAGCAATTTGGGAGGTTTTTG,AATTCAAAAACCTCCCAAATTGCTGGGATTACTCGAGTAATCCCAGCAATTTGGGAGG,n/a
human,1728,NQO1,NM_001025434.2,TRCN0000162795,NM_017842.1-1079s1c1,CTTCCAAAGTGCTGGGATTAT,pLKO.1,1713,3UTR,90,95,,,Y,55652,SLC48A1,CCGGCTTCCAAAGTGCTGGGATTATCTCGAGATAATCCCAGCACTTTGGAAGTTTTTG,AATTCAAAAACTTCCAAAGTGCTGGGATTATCTCGAGATAATCCCAGCACTTTGGAAG,n/a
human,1728,NQO1,NM_001025434.2,TRCN0000140657,NM_012099.1-2957s1c1,CCTCCCAAAGTGCTAGGATAA,pLKO.1,1712,3UTR,90,95,,,Y,10849,CD3EAP,CCGGCCTCCCAAAGTGCTAGGATAACTCGAGTTATCCTAGCACTTTGGGAGGTTTTTG,AATTCAAAAACCTCCCAAAGTGCTAGGATAACTCGAGTTATCCTAGCACTTTGGGAGG,n/a
human,1728,NQO1,NM_001025434.2,TRCN0000157407,NM_001003795.1-3187s1c1,GATCTCGGCTTACTGCAACTT,pLKO.1,1521,3UTR,90,95,,,Y,389524,GTF2IRD2B,CCGGGATCTCGGCTTACTGCAACTTCTCGAGAAGTTGCAGTAAGCCGAGATCTTTTTG,AATTCAAAAAGATCTCGGCTTACTGCAACTTCTCGAGAAGTTGCAGTAAGCCGAGATC,n/a
human,1728,NQO1,NM_001025434.2,TRCN0000168807,NM_178520.2-2253s1c1,GCTGATCTCAAACTCCTGATA,pLKO.1,1669,3UTR,85,95,,,Y,284186,TMEM105,CCGGGCTGATCTCAAACTCCTGATACTCGAGTATCAGGAGTTTGAGATCAGCTTTTTG,AATTCAAAAAGCTGATCTCAAACTCCTGATACTCGAGTATCAGGAGTTTGAGATCAGC,n/a
human,1728,NQO1,NM_001025434.2,TRCN0000047783,NM_017516.1-1624s1c1,GCCTCCAAAGTGCTGGAATTA,pLKO.1,1711,3UTR,90,90,,,Y,54734,RAB39A,CCGGGCCTCCAAAGTGCTGGAATTACTCGAGTAATTCCAGCACTTTGGAGGCTTTTTG,AATTCAAAAAGCCTCCAAAGTGCTGGAATTACTCGAGTAATTCCAGCACTTTGGAGGC,n/a
human,1728,NQO1,NM_001025434.2,TRCN0000198922,NM_178897.2-2085s1c1,GCTTCCCAAATGCTGGGATTA,pLKO.1,1711,3UTR,90,90,,,Y,100929,Tyw1,CCGGGCTTCCCAAATGCTGGGATTACTCGAGTAATCCCAGCATTTGGGAAGCTTTTTG,AATTCAAAAAGCTTCCCAAATGCTGGGATTACTCGAGTAATCCCAGCATTTGGGAAGC,n/a
human,1728,NQO1,NM_001025434.2,TRCN0000091448,NM_013513.1-2495s1c1,CCTCCCAAGTACTGGGATTAA,pLKO.1,1712,3UTR,86,90,,,Y,13828,Epb42,CCGGCCTCCCAAGTACTGGGATTAACTCGAGTTAATCCCAGTACTTGGGAGGTTTTTG,AATTCAAAAACCTCCCAAGTACTGGGATTAACTCGAGTTAATCCCAGTACTTGGGAGG,n/a
human,1728,NQO1,NM_001025434.2,TRCN0000269994,NM_001126321.1-106s21c1,TGCCATCATGGCTGATAATAT,pLKO_005,1606,3UTR,86,90,,,Y,236874,Gm14743,CCGGTGCCATCATGGCTGATAATATCTCGAGATATTATCAGCCATGATGGCATTTTTG,AATTCAAAAATGCCATCATGGCTGATAATATCTCGAGATATTATCAGCCATGATGGCA,n/a
human,1728,NQO1,NM_001025434.2,TRCN0000178479,NM_025511.1-274s1c1,GAATTGCCAGAGAAGGAATAA,pLKO.1,1217,3UTR,86,90,,,Y,66359,Cox20,CCGGGAATTGCCAGAGAAGGAATAACTCGAGTTATTCCTTCTCTGGCAATTCTTTTTG,AATTCAAAAAGAATTGCCAGAGAAGGAATAACTCGAGTTATTCCTTCTCTGGCAATTC,n/a
human,1728,NQO1,NM_001025434.2,TRCN0000339219,NM_025511.2-280s21c1,GAATTGCCAGAGAAGGAATAA,pLKO_005,1217,3UTR,86,90,,,Y,66359,Cox20,CCGGGAATTGCCAGAGAAGGAATAACTCGAGTTATTCCTTCTCTGGCAATTCTTTTTG,AATTCAAAAAGAATTGCCAGAGAAGGAATAACTCGAGTTATTCCTTCTCTGGCAATTC,n/a
human,1728,NQO1,NM_001025434.2,TRCN0000375679,NM_144835.4-878s21c1,GAAATCCTCTTTACCAGATTA,pLKO_005,2224,3UTR,81,90,,,Y,217995,Heatr1,CCGGGAAATCCTCTTTACCAGATTACTCGAGTAATCTGGTAAAGAGGATTTCTTTTTG,AATTCAAAAAGAAATCCTCTTTACCAGATTACTCGAGTAATCTGGTAAAGAGGATTTC,n/a
human,1728,NQO1,NM_001025434.2,TRCN0000140610,NM_025042.2-931s1c1,GCCTCTCAGGTTCAAGCAATT,pLKO.1,1544,3UTR,90,89,,,Y,,,CCGGGCCTCTCAGGTTCAAGCAATTCTCGAGAATTGCTTGAACCTGAGAGGCTTTTTG,AATTCAAAAAGCCTCTCAGGTTCAAGCAATTCTCGAGAATTGCTTGAACCTGAGAGGC,n/a
human,1728,NQO1,NM_001025434.2,TRCN0000254081,NM_001001394.3-446s21c1,GAAACCCGCTGGAGAATATTT,pLKO_005,634,CDS,90,89,,,Y,414061,DNAJB3,CCGGGAAACCCGCTGGAGAATATTTCTCGAGAAATATTCTCCAGCGGGTTTCTTTTTG,AATTCAAAAAGAAACCCGCTGGAGAATATTTCTCGAGAAATATTCTCCAGCGGGTTTC,n/a
human,1728,NQO1,NM_001025434.2,TRCN0000430981,NM_173537.2-3266s21c1,GCCACCATGCCTGGCTAATTT,pLKO_005,1607,3UTR,90,89,,,Y,84163,GTF2IRD2,CCGGGCCACCATGCCTGGCTAATTTCTCGAGAAATTAGCCAGGCATGGTGGCTTTTTG,AATTCAAAAAGCCACCATGCCTGGCTAATTTCTCGAGAAATTAGCCAGGCATGGTGGC,n/a
human,1728,NQO1,NM_001025434.2,TRCN0000134716,NM_022901.1-2328s1c1,GCCTGGCTAATTTCTGTATTT,pLKO.1,1615,3UTR,90,89,,,Y,64922,LRRC19,CCGGGCCTGGCTAATTTCTGTATTTCTCGAGAAATACAGAAATTAGCCAGGCTTTTTG,AATTCAAAAAGCCTGGCTAATTTCTGTATTTCTCGAGAAATACAGAAATTAGCCAGGC,n/a
human,1728,NQO1,NM_001025434.2,TRCN0000042823,NM_024055.2-973s1c1,CCTCACAAAGTGCTAGGATTA,pLKO.1,1712,3UTR,90,89,,,Y,64924,SLC30A5,CCGGCCTCACAAAGTGCTAGGATTACTCGAGTAATCCTAGCACTTTGTGAGGTTTTTG,AATTCAAAAACCTCACAAAGTGCTAGGATTACTCGAGTAATCCTAGCACTTTGTGAGG,n/a
human,1728,NQO1,NM_001025434.2,TRCN0000082462,XM_371492.2-638s1c1,CCTCCCAAAGTGCCAGGATTA,pLKO.1,1712,3UTR,90,89,,,Y,388949,LOC388949,CCGGCCTCCCAAAGTGCCAGGATTACTCGAGTAATCCTGGCACTTTGGGAGGTTTTTG,AATTCAAAAACCTCCCAAAGTGCCAGGATTACTCGAGTAATCCTGGCACTTTGGGAGG,n/a
human,1728,NQO1,NM_001025434.2,TRCN0000165736,NM_175901.3-1946s1c1,CCTCCCTAAGTGTTGGGATTA,pLKO.1,1712,3UTR,90,89,,,Y,283932,FBXL19-AS1,CCGGCCTCCCTAAGTGTTGGGATTACTCGAGTAATCCCAACACTTAGGGAGGTTTTTG,AATTCAAAAACCTCCCTAAGTGTTGGGATTACTCGAGTAATCCCAACACTTAGGGAGG,n/a
human,1728,NQO1,NM_001025434.2,TRCN0000166560,NM_207497.1-412s1c1,CCTCCGAAAGTGCTAGGATTA,pLKO.1,1712,3UTR,90,89,,,Y,401253,LINC00336,CCGGCCTCCGAAAGTGCTAGGATTACTCGAGTAATCCTAGCACTTTCGGAGGTTTTTG,AATTCAAAAACCTCCGAAAGTGCTAGGATTACTCGAGTAATCCTAGCACTTTCGGAGG,n/a
human,1728,NQO1,NM_001025434.2,TRCN0000164091,NM_024795.1-1273s1c1,CCTCCTAAAGTGCTGCGATTA,pLKO.1,1712,3UTR,90,89,,,Y,79853,TM4SF20,CCGGCCTCCTAAAGTGCTGCGATTACTCGAGTAATCGCAGCACTTTAGGAGGTTTTTG,AATTCAAAAACCTCCTAAAGTGCTGCGATTACTCGAGTAATCGCAGCACTTTAGGAGG,n/a
human,1728,NQO1,NM_001025434.2,TRCN0000177072,NM_153513.1-103s1c1,GATTACTATCAAGTGGCATAT,pLKO.1,1005,3UTR,90,89,,,Y,229600,BC028528,CCGGGATTACTATCAAGTGGCATATCTCGAGATATGCCACTTGATAGTAATCTTTTTG,AATTCAAAAAGATTACTATCAAGTGGCATATCTCGAGATATGCCACTTGATAGTAATC,n/a
human,1728,NQO1,NM_001025434.2,TRCN0000165027,NM_001013636.1-513s1c1,GAACTCCTGACCTCAAGTGAT,pLKO.1,1678,3UTR,90,89,,,Y,387873,LOC387873,CCGGGAACTCCTGACCTCAAGTGATCTCGAGATCACTTGAGGTCAGGAGTTCTTTTTG,AATTCAAAAAGAACTCCTGACCTCAAGTGATCTCGAGATCACTTGAGGTCAGGAGTTC,n/a
human,1728,NQO1,NM_001025434.2,TRCN0000165534,NM_001012717.1-362s1c1,GAGACAGGGTTTCACCATGTT,pLKO.1,1642,3UTR,90,89,,,Y,,,CCGGGAGACAGGGTTTCACCATGTTCTCGAGAACATGGTGAAACCCTGTCTCTTTTTG,AATTCAAAAAGAGACAGGGTTTCACCATGTTCTCGAGAACATGGTGAAACCCTGTCTC,n/a
human,1728,NQO1,NM_001025434.2,TRCN0000168774,NM_001013670.1-1394s1c1,GAGATGGAGTTTCACCATGTT,pLKO.1,1642,3UTR,90,89,,,Y,400464,LOC400464,CCGGGAGATGGAGTTTCACCATGTTCTCGAGAACATGGTGAAACTCCATCTCTTTTTG,AATTCAAAAAGAGATGGAGTTTCACCATGTTCTCGAGAACATGGTGAAACTCCATCTC,n/a
human,1728,NQO1,NM_001025434.2,TRCN0000140238,NM_024895.3-1807s1c1,GTCTCCCAAAGTGCTAGGATT,pLKO.1,1711,3UTR,90,89,,,Y,79955,PDZD7,CCGGGTCTCCCAAAGTGCTAGGATTCTCGAGAATCCTAGCACTTTGGGAGACTTTTTG,AATTCAAAAAGTCTCCCAAAGTGCTAGGATTCTCGAGAATCCTAGCACTTTGGGAGAC,n/a
human,1728,NQO1,NM_001025434.2,TRCN0000129445,NM_145048.2-1500s1c1,GACTTCCAAAGTGCTGGGATT,pLKO.1,1711,3UTR,90,89,,,Y,133015,PACRGL,CCGGGACTTCCAAAGTGCTGGGATTCTCGAGAATCCCAGCACTTTGGAAGTCTTTTTG,AATTCAAAAAGACTTCCAAAGTGCTGGGATTCTCGAGAATCCCAGCACTTTGGAAGTC,n/a
human,1728,NQO1,NM_001025434.2,TRCN0000140759,NM_018265.1-3067s1c1,GCCTTTCAAAGTGCTGGGATT,pLKO.1,1711,3UTR,90,89,,,Y,55765,INAVA,CCGGGCCTTTCAAAGTGCTGGGATTCTCGAGAATCCCAGCACTTTGAAAGGCTTTTTG,AATTCAAAAAGCCTTTCAAAGTGCTGGGATTCTCGAGAATCCCAGCACTTTGAAAGGC,n/a
human,1728,NQO1,NM_001025434.2,TRCN0000155070,NM_017873.2-2761s1c1,GCCTTTCAAAGTGCTGGGATT,pLKO.1,1711,3UTR,90,89,,,Y,140459,ASB6,CCGGGCCTTTCAAAGTGCTGGGATTCTCGAGAATCCCAGCACTTTGAAAGGCTTTTTG,AATTCAAAAAGCCTTTCAAAGTGCTGGGATTCTCGAGAATCCCAGCACTTTGAAAGGC,n/a
human,1728,NQO1,NM_001025434.2,TRCN0000165025,NM_207497.1-421s1c1,GTGCTAGGATTATAGGCGTGA,pLKO.1,1721,3UTR,90,89,,,Y,401253,LINC00336,CCGGGTGCTAGGATTATAGGCGTGACTCGAGTCACGCCTATAATCCTAGCACTTTTTG,AATTCAAAAAGTGCTAGGATTATAGGCGTGACTCGAGTCACGCCTATAATCCTAGCAC,n/a
human,1728,NQO1,NM_001025434.2,TRCN0000163829,NM_173639.1-1102s1c1,CCTCCCAAATTACTGGGATTA,pLKO.1,1712,3UTR,90,89,,,Y,284618,RUSC1-AS1,CCGGCCTCCCAAATTACTGGGATTACTCGAGTAATCCCAGTAATTTGGGAGGTTTTTG,AATTCAAAAACCTCCCAAATTACTGGGATTACTCGAGTAATCCCAGTAATTTGGGAGG,n/a
human,1728,NQO1,NM_001025434.2,TRCN0000057398,NM_002261.1-793s1c1,CCTCCCAAGTTGCTGGGATTA,pLKO.1,1712,3UTR,90,89,,,Y,3823,KLRC3,CCGGCCTCCCAAGTTGCTGGGATTACTCGAGTAATCCCAGCAACTTGGGAGGTTTTTG,AATTCAAAAACCTCCCAAGTTGCTGGGATTACTCGAGTAATCCCAGCAACTTGGGAGG,n/a
human,1728,NQO1,NM_001025434.2,TRCN0000140374,NM_025042.2-1098s1c1,GCTTCCCAAAGTACTGGGATT,pLKO.1,1711,3UTR,90,89,,,Y,,,CCGGGCTTCCCAAAGTACTGGGATTCTCGAGAATCCCAGTACTTTGGGAAGCTTTTTG,AATTCAAAAAGCTTCCCAAAGTACTGGGATTCTCGAGAATCCCAGTACTTTGGGAAGC,n/a
human,1728,NQO1,NM_001025434.2,TRCN0000005648,NM_017860.3-1018s1c1,GCCTGGAGGATATTTGGAATA,pLKO.1,639,CDS,85,89,,,Y,54964,C1orf56,CCGGGCCTGGAGGATATTTGGAATACTCGAGTATTCCAAATATCCTCCAGGCTTTTTG,AATTCAAAAAGCCTGGAGGATATTTGGAATACTCGAGTATTCCAAATATCCTCCAGGC,n/a
human,1728,NQO1,NM_001025434.2,TRCN0000357066,NM_054021.1-599s21c1,TCATCGTCATTCCACTGATTG,pLKO_005,2059,3UTR,85,89,,,Y,83550,GPR101,CCGGTCATCGTCATTCCACTGATTGCTCGAGCAATCAGTGGAATGACGATGATTTTTG,AATTCAAAAATCATCGTCATTCCACTGATTGCTCGAGCAATCAGTGGAATGACGATGA,n/a
human,1728,NQO1,NM_001025434.2,TRCN0000119057,NM_015570.1-4694s1c1,CCCTTCAACTATGCAATGAAT,pLKO.1,170,CDS,85,89,,,Y,26053,AUTS2,CCGGCCCTTCAACTATGCAATGAATCTCGAGATTCATTGCATAGTTGAAGGGTTTTTG,AATTCAAAAACCCTTCAACTATGCAATGAATCTCGAGATTCATTGCATAGTTGAAGGG,n/a
human,1728,NQO1,NM_001025434.2,TRCN0000036582,XM_371503.1-654s1c1,GCAGTGCATTCCATTCACCAT,pLKO.1,434,CDS,85,89,,,Y,388963,C2orf81,CCGGGCAGTGCATTCCATTCACCATCTCGAGATGGTGAATGGAATGCACTGCTTTTTG,AATTCAAAAAGCAGTGCATTCCATTCACCATCTCGAGATGGTGAATGGAATGCACTGC,n/a
human,1728,NQO1,NM_001025434.2,TRCN0000116737,NM_016369.3-2405s1c1,CCTCCCAAGTAGCTGGAATTA,pLKO.1,1577,3UTR,85,89,,,Y,51208,CLDN18,CCGGCCTCCCAAGTAGCTGGAATTACTCGAGTAATTCCAGCTACTTGGGAGGTTTTTG,AATTCAAAAACCTCCCAAGTAGCTGGAATTACTCGAGTAATTCCAGCTACTTGGGAGG,n/a
human,1728,NQO1,NM_001025434.2,TRCN0000165774,NM_001012391.1-946s1c1,CCTCCTAAGTAGCTGGGATTA,pLKO.1,1577,3UTR,85,89,,,Y,100652781,SNX29P1,CCGGCCTCCTAAGTAGCTGGGATTACTCGAGTAATCCCAGCTACTTAGGAGGTTTTTG,AATTCAAAAACCTCCTAAGTAGCTGGGATTACTCGAGTAATCCCAGCTACTTAGGAGG,n/a
human,1728,NQO1,NM_001025434.2,TRCN0000060503,NM_001001414.1-1521s1c1,CCTCTCAAGTAGCTGGGATTA,pLKO.1,1577,3UTR,85,89,,,Y,342897,NCCRP1,CCGGCCTCTCAAGTAGCTGGGATTACTCGAGTAATCCCAGCTACTTGAGAGGTTTTTG,AATTCAAAAACCTCTCAAGTAGCTGGGATTACTCGAGTAATCCCAGCTACTTGAGAGG,n/a
human,1728,NQO1,NM_001025434.2,TRCN0000155576,NM_198582.1-3137s1c1,CCTCTCAAGTAGCTGGGATTA,pLKO.1,1577,3UTR,85,89,,,Y,377007,KLHL30,CCGGCCTCTCAAGTAGCTGGGATTACTCGAGTAATCCCAGCTACTTGAGAGGTTTTTG,AATTCAAAAACCTCTCAAGTAGCTGGGATTACTCGAGTAATCCCAGCTACTTGAGAGG,n/a
human,1728,NQO1,NM_001025434.2,TRCN0000165697,NM_017842.1-943s1c1,CCTCTCAAGTAGCTGGGATTA,pLKO.1,1577,3UTR,85,89,,,Y,55652,SLC48A1,CCGGCCTCTCAAGTAGCTGGGATTACTCGAGTAATCCCAGCTACTTGAGAGGTTTTTG,AATTCAAAAACCTCTCAAGTAGCTGGGATTACTCGAGTAATCCCAGCTACTTGAGAGG,n/a
human,1728,NQO1,NM_001025434.2,TRCN0000138395,XM_374933.1-1847s1c1,CCTTCCAAGTAGCTGGGATTA,pLKO.1,1577,3UTR,85,89,,,Y,399949,C11orf88,CCGGCCTTCCAAGTAGCTGGGATTACTCGAGTAATCCCAGCTACTTGGAAGGTTTTTG,AATTCAAAAACCTTCCAAGTAGCTGGGATTACTCGAGTAATCCCAGCTACTTGGAAGG,n/a
human,1728,NQO1,NM_001025434.2,TRCN0000145334,NM_052904.1-2301s1c1,GCTTCCTTGTCTTGCTTTATA,pLKO.1,889,3UTR,80,89,,,Y,114792,KLHL32,CCGGGCTTCCTTGTCTTGCTTTATACTCGAGTATAAAGCAAGACAAGGAAGCTTTTTG,AATTCAAAAAGCTTCCTTGTCTTGCTTTATACTCGAGTATAAAGCAAGACAAGGAAGC,n/a
human,1728,NQO1,NM_001025434.2,TRCN0000232629,NM_000518.4-394s21c1,TGGCCCATCACTTTGGCAAAG,pLKO_005,774,CDS,80,89,,,Y,3043,HBB,CCGGTGGCCCATCACTTTGGCAAAGCTCGAGCTTTGCCAAAGTGATGGGCCATTTTTG,AATTCAAAAATGGCCCATCACTTTGGCAAAGCTCGAGCTTTGCCAAAGTGATGGGCCA,n/a
human,1728,NQO1,NM_001025434.2,TRCN0000069663,NM_019701.1-233s1c1,CTATGCTATGAACTTCACTAT,pLKO.1,247,CDS,80,89,,,Y,56365,Clcnkb,CCGGCTATGCTATGAACTTCACTATCTCGAGATAGTGAAGTTCATAGCATAGTTTTTG,AATTCAAAAACTATGCTATGAACTTCACTATCTCGAGATAGTGAAGTTCATAGCATAG,n/a
human,1728,NQO1,NM_001025434.2,TRCN0000067079,NM_145137.1-116s1c1,GATGAGAAATGGTGACAAGAA,pLKO.1,2141,3UTR,80,89,,,Y,216864,Mgl2,CCGGGATGAGAAATGGTGACAAGAACTCGAGTTCTTGTCACCATTTCTCATCTTTTTG,AATTCAAAAAGATGAGAAATGGTGACAAGAACTCGAGTTCTTGTCACCATTTCTCATC,n/a
human,1728,NQO1,NM_001025434.2,TRCN0000186377,XM_293680.2-311s1c1,CTCATTCCAAACTGATGACTT,pLKO.1,1927,3UTR,86,85,,,Y,345051,REELD1,CCGGCTCATTCCAAACTGATGACTTCTCGAGAAGTCATCAGTTTGGAATGAGTTTTTG,AATTCAAAAACTCATTCCAAACTGATGACTTCTCGAGAAGTCATCAGTTTGGAATGAG,n/a
human,1728,NQO1,NM_001025434.2,TRCN0000039104,NM_019448.2-576s1c1,CTGTACCAGATGCTACTGTTT,pLKO.1,2233,3UTR,77,85,,,Y,54427,Dnmt3l,CCGGCTGTACCAGATGCTACTGTTTCTCGAGAAACAGTAGCATCTGGTACAGTTTTTG,AATTCAAAAACTGTACCAGATGCTACTGTTTCTCGAGAAACAGTAGCATCTGGTACAG,n/a
