Taxon,"Gene ID","Gene Symbol",Transcript,"Clone ID","Legacy Clone Name","Target Seq",Vector,"Match Position","Match Region","Match %","SDR Match %","Intrinsic Score","Adjusted Score","Matches Other Gene in Same Taxon?","Orig. Target Gene ID","Orig. Target Gene Symbol","Forward Oligo Sequence","Reverse Oligo Sequence",Addgene
human,154790,CLEC2L,NM_001080511.4,TRCN0000239630,NM_001080511.2-420s21c1,CCAGAAGGAGCTGGAATTTAT,pLKO_005,663,CDS,100,100,15,10.5,N,154790,CLEC2L,CCGGCCAGAAGGAGCTGGAATTTATCTCGAGATAAATTCCAGCTCCTTCTGGTTTTTG,AATTCAAAAACCAGAAGGAGCTGGAATTTATCTCGAGATAAATTCCAGCTCCTTCTGG,n/a
human,154790,CLEC2L,NM_001080511.4,TRCN0000239628,NM_001080511.2-842s21c1,CGTGTGGCTCAGCAGTTAAAT,pLKO_005,1085,3UTR,100,100,15,10.5,N,154790,CLEC2L,CCGGCGTGTGGCTCAGCAGTTAAATCTCGAGATTTAACTGCTGAGCCACACGTTTTTG,AATTCAAAAACGTGTGGCTCAGCAGTTAAATCTCGAGATTTAACTGCTGAGCCACACG,n/a
human,154790,CLEC2L,NM_001080511.4,TRCN0000239626,NM_001080511.2-621s21c1,GTGCAGCAAGATGGCCTATAC,pLKO_005,864,CDS,100,100,10.8,7.56,N,154790,CLEC2L,CCGGGTGCAGCAAGATGGCCTATACCTCGAGGTATAGGCCATCTTGCTGCACTTTTTG,AATTCAAAAAGTGCAGCAAGATGGCCTATACCTCGAGGTATAGGCCATCTTGCTGCAC,n/a
human,154790,CLEC2L,NM_001080511.4,TRCN0000240287,NM_001101507.1-779s21c1,GTGCAGCAAGATGGCCTATAC,pLKO_005,864,CDS,100,100,10.8,7.56,N,665180,Clec2l,CCGGGTGCAGCAAGATGGCCTATACCTCGAGGTATAGGCCATCTTGCTGCACTTTTTG,AATTCAAAAAGTGCAGCAAGATGGCCTATACCTCGAGGTATAGGCCATCTTGCTGCAC,n/a
human,154790,CLEC2L,NM_001080511.4,TRCN0000239627,NM_001080511.2-466s21c1,TGGATTGGACTACGCAGAGTT,pLKO_005,709,CDS,100,100,4.95,3.465,N,154790,CLEC2L,CCGGTGGATTGGACTACGCAGAGTTCTCGAGAACTCTGCGTAGTCCAATCCATTTTTG,AATTCAAAAATGGATTGGACTACGCAGAGTTCTCGAGAACTCTGCGTAGTCCAATCCA,n/a
human,154790,CLEC2L,NM_001080511.4,TRCN0000239629,NM_001080511.2-320s21c1,ACGGAAGGAAGTGCTACTTCT,pLKO_005,563,CDS,100,100,4.95,2.97,N,154790,CLEC2L,CCGGACGGAAGGAAGTGCTACTTCTCTCGAGAGAAGTAGCACTTCCTTCCGTTTTTTG,AATTCAAAAAACGGAAGGAAGTGCTACTTCTCTCGAGAGAAGTAGCACTTCCTTCCGT,n/a
human,154790,CLEC2L,NM_001080511.4,TRCN0000218810,NM_001101507.1-579s21c1,CAGAAGGAACTGGAATTTATG,pLKO_005,664,CDS,95,95,,,N,665180,Clec2l,CCGGCAGAAGGAACTGGAATTTATGCTCGAGCATAAATTCCAGTTCCTTCTGTTTTTG,AATTCAAAAACAGAAGGAACTGGAATTTATGCTCGAGCATAAATTCCAGTTCCTTCTG,n/a
human,154790,CLEC2L,NM_001080511.4,TRCN0000079740,NM_023596.2-474s1c1,GCCATCTTCGTGGTTATGATT,pLKO.1,481,CDS,80,89,,,Y,71279,Slc29a3,CCGGGCCATCTTCGTGGTTATGATTCTCGAGAATCATAACCACGAAGATGGCTTTTTG,AATTCAAAAAGCCATCTTCGTGGTTATGATTCTCGAGAATCATAACCACGAAGATGGC,n/a
human,154790,CLEC2L,NM_001080511.4,TRCN0000181658,NM_026964.2-130s1c1,GAAACAGAAGGAGCTGGAAGA,pLKO.1,660,CDS,80,89,,,Y,234388,Ccdc124,CCGGGAAACAGAAGGAGCTGGAAGACTCGAGTCTTCCAGCTCCTTCTGTTTCTTTTTG,AATTCAAAAAGAAACAGAAGGAGCTGGAAGACTCGAGTCTTCCAGCTCCTTCTGTTTC,n/a
human,154790,CLEC2L,NM_001080511.4,TRCN0000025904,NM_019987.1-2172s1c1,CACAACCACGAGGCGGTGTAA,pLKO.1,628,CDS,80,89,,,Y,56542,Ick,CCGGCACAACCACGAGGCGGTGTAACTCGAGTTACACCGCCTCGTGGTTGTGTTTTTG,AATTCAAAAACACAACCACGAGGCGGTGTAACTCGAGTTACACCGCCTCGTGGTTGTG,n/a
human,154790,CLEC2L,NM_001080511.4,TRCN0000322184,NM_019987.1-2172s21c1,CACAACCACGAGGCGGTGTAA,pLKO_005,628,CDS,80,89,,,Y,56542,Ick,CCGGCACAACCACGAGGCGGTGTAACTCGAGTTACACCGCCTCGTGGTTGTGTTTTTG,AATTCAAAAACACAACCACGAGGCGGTGTAACTCGAGTTACACCGCCTCGTGGTTGTG,n/a
