Taxon,"Gene ID","Gene Symbol",Transcript,"Clone ID","Legacy Clone Name","Target Seq",Vector,"Match Position","Match Region","Match %","SDR Match %","Intrinsic Score","Adjusted Score","Matches Other Gene in Same Taxon?","Orig. Target Gene ID","Orig. Target Gene Symbol","Forward Oligo Sequence","Reverse Oligo Sequence",Addgene
mouse,269633,Wdr86,NM_001081441.1,TRCN0000190166,NM_026621.1-187s1c1,CTCACGCCTCTTTAGCAACAA,pLKO.1,1420,CDS,100,100,4.95,6.93,N,269633,Wdr86,CCGGCTCACGCCTCTTTAGCAACAACTCGAGTTGTTGCTAAAGAGGCGTGAGTTTTTG,AATTCAAAAACTCACGCCTCTTTAGCAACAACTCGAGTTGTTGCTAAAGAGGCGTGAG,n/a
mouse,269633,Wdr86,NM_001081441.1,TRCN0000190673,NM_026621.1-364s1c1,GCTTTGCTACTTGGGATACTT,pLKO.1,1597,3UTR,100,100,5.625,3.9375,N,269633,Wdr86,CCGGGCTTTGCTACTTGGGATACTTCTCGAGAAGTATCCCAAGTAGCAAAGCTTTTTG,AATTCAAAAAGCTTTGCTACTTGGGATACTTCTCGAGAAGTATCCCAAGTAGCAAAGC,n/a
mouse,269633,Wdr86,NM_001081441.1,TRCN0000201548,NM_026621.1-365s1c1,CTTTGCTACTTGGGATACTTC,pLKO.1,1598,3UTR,100,100,4.95,3.465,N,269633,Wdr86,CCGGCTTTGCTACTTGGGATACTTCCTCGAGGAAGTATCCCAAGTAGCAAAGTTTTTG,AATTCAAAAACTTTGCTACTTGGGATACTTCCTCGAGGAAGTATCCCAAGTAGCAAAG,n/a
mouse,269633,Wdr86,NM_001081441.1,TRCN0000189475,NM_026621.1-360s1c1,CAAGGCTTTGCTACTTGGGAT,pLKO.1,1593,3UTR,100,100,2.64,1.848,N,269633,Wdr86,CCGGCAAGGCTTTGCTACTTGGGATCTCGAGATCCCAAGTAGCAAAGCCTTGTTTTTG,AATTCAAAAACAAGGCTTTGCTACTTGGGATCTCGAGATCCCAAGTAGCAAAGCCTTG,n/a
mouse,269633,Wdr86,NM_001081441.1,TRCN0000189438,NM_026621.1-315s1c1,CCCAATGTGGAGGAAGAAACA,pLKO.1,1548,3UTR,95,95,,,N,269633,Wdr86,CCGGCCCAATGTGGAGGAAGAAACACTCGAGTGTTTCTTCCTCCACATTGGGTTTTTG,AATTCAAAAACCCAATGTGGAGGAAGAAACACTCGAGTGTTTCTTCCTCCACATTGGG,n/a
mouse,269633,Wdr86,NM_001081441.1,TRCN0000202037,NM_026621.1-305s1c1,CATGACCTTTCCCAATGTGGA,pLKO.1,1538,3UTR,95,95,,,N,269633,Wdr86,CCGGCATGACCTTTCCCAATGTGGACTCGAGTCCACATTGGGAAAGGTCATGTTTTTG,AATTCAAAAACATGACCTTTCCCAATGTGGACTCGAGTCCACATTGGGAAAGGTCATG,n/a
mouse,269633,Wdr86,NM_001081441.1,TRCN0000434969,NM_198285.2-601s21c1,CGCTCCTGCAAGGACATGAAA,pLKO_005,489,CDS,90,95,,,N,349136,WDR86,CCGGCGCTCCTGCAAGGACATGAAACTCGAGTTTCATGTCCTTGCAGGAGCGTTTTTG,AATTCAAAAACGCTCCTGCAAGGACATGAAACTCGAGTTTCATGTCCTTGCAGGAGCG,n/a
mouse,269633,Wdr86,NM_001081441.1,TRCN0000064195,NM_198285.1-482s1c1,GCAGTGCTGTGCCTAGTGCTA,pLKO.1,920,CDS,90,95,,,N,349136,WDR86,CCGGGCAGTGCTGTGCCTAGTGCTACTCGAGTAGCACTAGGCACAGCACTGCTTTTTG,AATTCAAAAAGCAGTGCTGTGCCTAGTGCTACTCGAGTAGCACTAGGCACAGCACTGC,n/a
mouse,269633,Wdr86,NM_001081441.1,TRCN0000042344,NM_013711.1-1462s1c1,CCAAGGATTTGCTCTTGGGAT,pLKO.1,1592,3UTR,90,90,,,Y,26462,Txnrd2,CCGGCCAAGGATTTGCTCTTGGGATCTCGAGATCCCAAGAGCAAATCCTTGGTTTTTG,AATTCAAAAACCAAGGATTTGCTCTTGGGATCTCGAGATCCCAAGAGCAAATCCTTGG,n/a
mouse,269633,Wdr86,NM_001081441.1,TRCN0000417581,NM_198285.2-733s21c1,GACACACGTCCATCGTGAACA,pLKO_005,621,CDS,90,89,,,Y,349136,WDR86,CCGGGACACACGTCCATCGTGAACACTCGAGTGTTCACGATGGACGTGTGTCTTTTTG,AATTCAAAAAGACACACGTCCATCGTGAACACTCGAGTGTTCACGATGGACGTGTGTC,n/a
mouse,269633,Wdr86,NM_001081441.1,TRCN0000027595,NM_145138.1-2191s1c1,GCTCTGATATCTGTACCTCAT,pLKO.1,1639,3UTR,85,89,,,Y,217718,Nek9,CCGGGCTCTGATATCTGTACCTCATCTCGAGATGAGGTACAGATATCAGAGCTTTTTG,AATTCAAAAAGCTCTGATATCTGTACCTCATCTCGAGATGAGGTACAGATATCAGAGC,n/a
mouse,269633,Wdr86,NM_001081441.1,TRCN0000292541,NM_145138.2-2216s21c1,GCTCTGATATCTGTACCTCAT,pLKO_005,1639,3UTR,85,89,,,Y,217718,Nek9,CCGGGCTCTGATATCTGTACCTCATCTCGAGATGAGGTACAGATATCAGAGCTTTTTG,AATTCAAAAAGCTCTGATATCTGTACCTCATCTCGAGATGAGGTACAGATATCAGAGC,n/a
mouse,269633,Wdr86,NM_001081441.1,TRCN0000425748,NM_005952.3-238s21c1,AGTGCAGCTGCTGTGCCTGAT,pLKO_005,917,CDS,85,89,,,Y,4501,MT1X,CCGGAGTGCAGCTGCTGTGCCTGATCTCGAGATCAGGCACAGCAGCTGCACTTTTTTG,AATTCAAAAAAGTGCAGCTGCTGTGCCTGATCTCGAGATCAGGCACAGCAGCTGCACT,n/a
mouse,269633,Wdr86,NM_001081441.1,TRCN0000416083,NM_020753.3-4615s21c1,GTAGGTGTACAGAGGACATGT,pLKO_005,607,CDS,80,89,,,N,57513,CASKIN2,CCGGGTAGGTGTACAGAGGACATGTCTCGAGACATGTCCTCTGTACACCTACTTTTTG,AATTCAAAAAGTAGGTGTACAGAGGACATGTCTCGAGACATGTCCTCTGTACACCTAC,n/a
mouse,269633,Wdr86,NM_001081441.1,TRCN0000232319,NM_032752.1-1127s21c1,CTCCATTCAAGGACATGATTT,pLKO_005,491,CDS,80,89,,,Y,84838,ZNF496,CCGGCTCCATTCAAGGACATGATTTCTCGAGAAATCATGTCCTTGAATGGAGTTTTTG,AATTCAAAAACTCCATTCAAGGACATGATTTCTCGAGAAATCATGTCCTTGAATGGAG,n/a
mouse,269633,Wdr86,NM_001081441.1,TRCN0000304275,NM_146018.1-710s21c1,GCCACACCTTCTTCATCAAAG,pLKO_005,1275,CDS,80,89,,,Y,216805,Flcn,CCGGGCCACACCTTCTTCATCAAAGCTCGAGCTTTGATGAAGAAGGTGTGGCTTTTTG,AATTCAAAAAGCCACACCTTCTTCATCAAAGCTCGAGCTTTGATGAAGAAGGTGTGGC,n/a
mouse,269633,Wdr86,NM_001081441.1,TRCN0000016735,NM_032752.1-1126s1c1,TCTCCATTCAAGGACATGATT,pLKO.1,490,CDS,80,89,,,Y,84838,ZNF496,CCGGTCTCCATTCAAGGACATGATTCTCGAGAATCATGTCCTTGAATGGAGATTTTTG,AATTCAAAAATCTCCATTCAAGGACATGATTCTCGAGAATCATGTCCTTGAATGGAGA,n/a
mouse,269633,Wdr86,NM_001081441.1,TRCN0000189623,NM_031382.1-3473s1c1,CCAAGAAGGTTCTGAGGAGAT,pLKO.1,96,5UTR,80,89,,,Y,83556,Tex16,CCGGCCAAGAAGGTTCTGAGGAGATCTCGAGATCTCCTCAGAACCTTCTTGGTTTTTG,AATTCAAAAACCAAGAAGGTTCTGAGGAGATCTCGAGATCTCCTCAGAACCTTCTTGG,n/a
mouse,269633,Wdr86,NM_001081441.1,TRCN0000082473,XM_497469.1-88s1c1,CTGTGTGACAAAGGACAAGCT,pLKO.1,705,CDS,80,89,,,Y,390641,LOC390641,CCGGCTGTGTGACAAAGGACAAGCTCTCGAGAGCTTGTCCTTTGTCACACAGTTTTTG,AATTCAAAAACTGTGTGACAAAGGACAAGCTCTCGAGAGCTTGTCCTTTGTCACACAG,n/a
mouse,269633,Wdr86,NM_001081441.1,TRCN0000141692,NM_001025447.1-116s1c1,CTGCATGGAAGCACCATGAAA,pLKO.1,802,CDS,77,85,,,Y,,,CCGGCTGCATGGAAGCACCATGAAACTCGAGTTTCATGGTGCTTCCATGCAGTTTTTG,AATTCAAAAACTGCATGGAAGCACCATGAAACTCGAGTTTCATGGTGCTTCCATGCAG,n/a
