Taxon,"Gene ID","Gene Symbol",Transcript,"Clone ID","Legacy Clone Name","Target Seq",Vector,"Match Position","Match Region","Match %","SDR Match %","Intrinsic Score","Adjusted Score","Matches Other Gene in Same Taxon?","Orig. Target Gene ID","Orig. Target Gene Symbol","Forward Oligo Sequence","Reverse Oligo Sequence",Addgene
mouse,100502876,Kcnmb3,NM_001195074.1,TRCN0000069861,XM_487724.1-919s1c1,GTTGTCTTTCACTGCTTATTT,pLKO.1,592,CDS,100,100,15,10.5,N,100502876,Kcnmb3,CCGGGTTGTCTTTCACTGCTTATTTCTCGAGAAATAAGCAGTGAAAGACAACTTTTTG,AATTCAAAAAGTTGTCTTTCACTGCTTATTTCTCGAGAAATAAGCAGTGAAAGACAAC,n/a
mouse,100502876,Kcnmb3,NM_001195074.1,TRCN0000069859,XM_487724.1-837s1c1,CGATCACAACAATGGAACTTT,pLKO.1,510,CDS,100,100,5.625,3.9375,N,100502876,Kcnmb3,CCGGCGATCACAACAATGGAACTTTCTCGAGAAAGTTCCATTGTTGTGATCGTTTTTG,AATTCAAAAACGATCACAACAATGGAACTTTCTCGAGAAAGTTCCATTGTTGTGATCG,n/a
mouse,100502876,Kcnmb3,NM_001195074.1,TRCN0000069858,XM_487724.1-968s1c1,CCCTGATTGTTGGCTTGGTTA,pLKO.1,641,CDS,100,100,4.95,3.465,N,100502876,Kcnmb3,CCGGCCCTGATTGTTGGCTTGGTTACTCGAGTAACCAAGCCAACAATCAGGGTTTTTG,AATTCAAAAACCCTGATTGTTGGCTTGGTTACTCGAGTAACCAAGCCAACAATCAGGG,n/a
mouse,100502876,Kcnmb3,NM_001195074.1,TRCN0000069860,XM_487724.1-813s1c1,CGTCCTGGACATCAAGGAATT,pLKO.1,486,CDS,100,100,0,0,N,100502876,Kcnmb3,CCGGCGTCCTGGACATCAAGGAATTCTCGAGAATTCCTTGATGTCCAGGACGTTTTTG,AATTCAAAAACGTCCTGGACATCAAGGAATTCTCGAGAATTCCTTGATGTCCAGGACG,n/a
mouse,100502876,Kcnmb3,NM_001195074.1,TRCN0000112242,NM_008410.1-604s1c1,CACTGCTTATTTGGACCTTAA,pLKO.1,601,CDS,85,89,,,Y,16432,Itm2b,CCGGCACTGCTTATTTGGACCTTAACTCGAGTTAAGGTCCAAATAAGCAGTGTTTTTG,AATTCAAAAACACTGCTTATTTGGACCTTAACTCGAGTTAAGGTCCAAATAAGCAGTG,n/a
mouse,100502876,Kcnmb3,NM_001195074.1,TRCN0000112243,NM_008410.1-603s1c1,TCACTGCTTATTTGGACCTTA,pLKO.1,600,CDS,85,89,,,Y,16432,Itm2b,CCGGTCACTGCTTATTTGGACCTTACTCGAGTAAGGTCCAAATAAGCAGTGATTTTTG,AATTCAAAAATCACTGCTTATTTGGACCTTACTCGAGTAAGGTCCAAATAAGCAGTGA,n/a
mouse,100502876,Kcnmb3,NM_001195074.1,TRCN0000142526,NM_153375.1-1158s1c1,GTTCTGAAGAACTCTGGCCAA,pLKO.1,568,CDS,85,89,,,Y,257000,TINCR,CCGGGTTCTGAAGAACTCTGGCCAACTCGAGTTGGCCAGAGTTCTTCAGAACTTTTTG,AATTCAAAAAGTTCTGAAGAACTCTGGCCAACTCGAGTTGGCCAGAGTTCTTCAGAAC,n/a
mouse,100502876,Kcnmb3,NM_001195074.1,TRCN0000072216,rfp_513s1c1,CCACTACGACGCCGAGGTCAA,pLKO.1,399,CDS,85,89,,,Y,RFP,RFP,CCGGCCACTACGACGCCGAGGTCAACTCGAGTTGACCTCGGCGTCGTAGTGGTTTTTG,AATTCAAAAACCACTACGACGCCGAGGTCAACTCGAGTTGACCTCGGCGTCGTAGTGG,n/a
mouse,100502876,Kcnmb3,NM_001195074.1,TRCN0000231694,rfp_513s21c1,CCACTACGACGCCGAGGTCAA,pLKO_005,399,CDS,85,89,,,Y,RFP,RFP,CCGGCCACTACGACGCCGAGGTCAACTCGAGTTGACCTCGGCGTCGTAGTGGTTTTTG,AATTCAAAAACCACTACGACGCCGAGGTCAACTCGAGTTGACCTCGGCGTCGTAGTGG,n/a
mouse,100502876,Kcnmb3,NM_001195074.1,TRCN0000105099,NM_145525.2-1691s1c1,GCACAGAAAGTGCATTCTCTT,pLKO.1,382,CDS,80,89,,,Y,99031,Osbpl6,CCGGGCACAGAAAGTGCATTCTCTTCTCGAGAAGAGAATGCACTTTCTGTGCTTTTTG,AATTCAAAAAGCACAGAAAGTGCATTCTCTTCTCGAGAAGAGAATGCACTTTCTGTGC,n/a
