Taxon,"Gene ID","Gene Symbol",Transcript,"Clone ID","Legacy Clone Name","Target Seq",Vector,"Match Position","Match Region","Match %","SDR Match %","Intrinsic Score","Adjusted Score","Matches Other Gene in Same Taxon?","Orig. Target Gene ID","Orig. Target Gene Symbol","Forward Oligo Sequence","Reverse Oligo Sequence",Addgene
human,57699,CPNE5,NM_001314017.1,TRCN0000157659,NM_020939.1-266s1c1,GTCATCGACAACACGCTCAAT,pLKO.1,266,CDS,100,100,4.95,6.93,N,57699,CPNE5,CCGGGTCATCGACAACACGCTCAATCTCGAGATTGAGCGTGTTGTCGATGACTTTTTG,AATTCAAAAAGTCATCGACAACACGCTCAATCTCGAGATTGAGCGTGTTGTCGATGAC,n/a
human,57699,CPNE5,NM_001314017.1,TRCN0000151674,NM_020939.1-300s1c1,GCAAGTTCATTGTGGATTACT,pLKO.1,300,CDS,100,100,5.625,3.9375,N,57699,CPNE5,CCGGGCAAGTTCATTGTGGATTACTCTCGAGAGTAATCCACAATGAACTTGCTTTTTG,AATTCAAAAAGCAAGTTCATTGTGGATTACTCTCGAGAGTAATCCACAATGAACTTGC,n/a
human,57699,CPNE5,NM_001314017.1,TRCN0000151871,NM_020939.1-377s1c1,CCTGATTTATCCAAACACGAT,pLKO.1,377,CDS,100,100,2.64,1.848,N,57699,CPNE5,CCGGCCTGATTTATCCAAACACGATCTCGAGATCGTGTTTGGATAAATCAGGTTTTTG,AATTCAAAAACCTGATTTATCCAAACACGATCTCGAGATCGTGTTTGGATAAATCAGG,n/a
human,57699,CPNE5,NM_001314017.1,TRCN0000427227,NM_153166.2-154s21c1,AGGTGGAGATCACGGTGTCAT,pLKO_005,138,CDS,90,95,,,N,240058,Cpne5,CCGGAGGTGGAGATCACGGTGTCATCTCGAGATGACACCGTGATCTCCACCTTTTTTG,AATTCAAAAAAGGTGGAGATCACGGTGTCATCTCGAGATGACACCGTGATCTCCACCT,n/a
human,57699,CPNE5,NM_001314017.1,TRCN0000008561,NM_011847.1-434s1c1,CCAGATGATGTCTTCAGGGAA,pLKO.1,534,3UTR,90,95,,,Y,23950,Dnajb6,CCGGCCAGATGATGTCTTCAGGGAACTCGAGTTCCCTGAAGACATCATCTGGTTTTTG,AATTCAAAAACCAGATGATGTCTTCAGGGAACTCGAGTTCCCTGAAGACATCATCTGG,n/a
human,57699,CPNE5,NM_001314017.1,TRCN0000434040,NM_153166.2-248s21c1,GAACAAGCAATGGCGAGAGTT,pLKO_005,232,CDS,90,89,,,N,240058,Cpne5,CCGGGAACAAGCAATGGCGAGAGTTCTCGAGAACTCTCGCCATTGCTTGTTCTTTTTG,AATTCAAAAAGAACAAGCAATGGCGAGAGTTCTCGAGAACTCTCGCCATTGCTTGTTC,n/a
human,57699,CPNE5,NM_001314017.1,TRCN0000251569,NM_001024920.1-317s21c1,CCACGCTCATTCCTGACTTCA,pLKO_005,276,CDS,85,89,,,N,216964,Trp53i13,CCGGCCACGCTCATTCCTGACTTCACTCGAGTGAAGTCAGGAATGAGCGTGGTTTTTG,AATTCAAAAACCACGCTCATTCCTGACTTCACTCGAGTGAAGTCAGGAATGAGCGTGG,n/a
human,57699,CPNE5,NM_001314017.1,TRCN0000184107,NM_030818.2-934s1c1,CGAGGACAAGCAGAAACTCAA,pLKO.1,325,CDS,80,89,,,Y,81576,CCDC130,CCGGCGAGGACAAGCAGAAACTCAACTCGAGTTGAGTTTCTGCTTGTCCTCGTTTTTG,AATTCAAAAACGAGGACAAGCAGAAACTCAACTCGAGTTGAGTTTCTGCTTGTCCTCG,n/a
human,57699,CPNE5,NM_001314017.1,TRCN0000432551,NM_134224.1-870s21c1,CTTTGATGTCCATATTGCTAA,pLKO_005,685,3UTR,80,89,,,Y,171258,Vmn1r202,CCGGCTTTGATGTCCATATTGCTAACTCGAGTTAGCAATATGGACATCAAAGTTTTTG,AATTCAAAAACTTTGATGTCCATATTGCTAACTCGAGTTAGCAATATGGACATCAAAG,n/a
human,57699,CPNE5,NM_001314017.1,TRCN0000075701,NM_173370.3-1402s1c1,GCAAACACGATTCCTGGACAT,pLKO.1,387,CDS,77,85,,,Y,74596,Cds1,CCGGGCAAACACGATTCCTGGACATCTCGAGATGTCCAGGAATCGTGTTTGCTTTTTG,AATTCAAAAAGCAAACACGATTCCTGGACATCTCGAGATGTCCAGGAATCGTGTTTGC,n/a
human,57699,CPNE5,NM_001314017.1,TRCN0000453326,NM_005267.4-200s21c1,ATCCGACTTCGTGTGCAACAC,pLKO_005,285,CDS,77,85,,,Y,2703,GJA8,CCGGATCCGACTTCGTGTGCAACACCTCGAGGTGTTGCACACGAAGTCGGATTTTTTG,AATTCAAAAAATCCGACTTCGTGTGCAACACCTCGAGGTGTTGCACACGAAGTCGGAT,n/a
