Taxon,"Gene ID","Gene Symbol",Transcript,"Clone ID","Legacy Clone Name","Target Seq",Vector,"Match Position","Match Region","Match %","SDR Match %","Intrinsic Score","Adjusted Score","Matches Other Gene in Same Taxon?","Orig. Target Gene ID","Orig. Target Gene Symbol","Forward Oligo Sequence","Reverse Oligo Sequence",Addgene
human,7404,UTY,NM_182660.1,TRCN0000229955,NM_007125.3-2862s21c1,GGCAACTAGCACTGGTATTAA,pLKO_005,2862,CDS,100,100,15,21,N,7404,UTY,CCGGGGCAACTAGCACTGGTATTAACTCGAGTTAATACCAGTGCTAGTTGCCTTTTTG,AATTCAAAAAGGCAACTAGCACTGGTATTAACTCGAGTTAATACCAGTGCTAGTTGCC,n/a
human,7404,UTY,NM_182660.1,TRCN0000108116,NM_007125.3-2298s1c1,GCGAGCAAATAGAGATAATTT,pLKO.1,2298,CDS,100,100,15,12,N,7404,UTY,CCGGGCGAGCAAATAGAGATAATTTCTCGAGAAATTATCTCTATTTGCTCGCTTTTTG,AATTCAAAAAGCGAGCAAATAGAGATAATTTCTCGAGAAATTATCTCTATTTGCTCGC,n/a
human,7404,UTY,NM_182660.1,TRCN0000108117,NM_007125.3-2633s1c1,GCAGTAATTGTATAGCAGGAA,pLKO.1,2633,CDS,100,100,2.64,1.848,N,7404,UTY,CCGGGCAGTAATTGTATAGCAGGAACTCGAGTTCCTGCTATACAATTACTGCTTTTTG,AATTCAAAAAGCAGTAATTGTATAGCAGGAACTCGAGTTCCTGCTATACAATTACTGC,n/a
human,7404,UTY,NM_182660.1,TRCN0000218022,NM_007125.3-2001s21c1,GGATGCTTTACAGGCATATAT,pLKO_005,2001,CDS,100,100,15,9,N,7404,UTY,CCGGGGATGCTTTACAGGCATATATCTCGAGATATATGCCTGTAAAGCATCCTTTTTG,AATTCAAAAAGGATGCTTTACAGGCATATATCTCGAGATATATGCCTGTAAAGCATCC,n/a
human,7404,UTY,NM_182660.1,TRCN0000229956,NM_007125.3-3657s21c1,TCCACCCACACCTAGTATTTA,pLKO_005,3657,CDS,100,100,15,9,N,7404,UTY,CCGGTCCACCCACACCTAGTATTTACTCGAGTAAATACTAGGTGTGGGTGGATTTTTG,AATTCAAAAATCCACCCACACCTAGTATTTACTCGAGTAAATACTAGGTGTGGGTGGA,n/a
human,7404,UTY,NM_182660.1,TRCN0000165534,NM_001012717.1-362s1c1,GAGACAGGGTTTCACCATGTT,pLKO.1,4129,CDS,100,100,4.95,2.475,Y,,,CCGGGAGACAGGGTTTCACCATGTTCTCGAGAACATGGTGAAACCCTGTCTCTTTTTG,AATTCAAAAAGAGACAGGGTTTCACCATGTTCTCGAGAACATGGTGAAACCCTGTCTC,n/a
human,7404,UTY,NM_182660.1,TRCN0000155836,NM_198582.1-3275s1c1,CCCAAAGTGCTGGGATTACAA,pLKO.1,4202,CDS,95,100,5.625,2.8125,Y,377007,KLHL30,CCGGCCCAAAGTGCTGGGATTACAACTCGAGTTGTAATCCCAGCACTTTGGGTTTTTG,AATTCAAAAACCCAAAGTGCTGGGATTACAACTCGAGTTGTAATCCCAGCACTTTGGG,n/a
human,7404,UTY,NM_182660.1,TRCN0000141025,NM_152361.1-835s1c1,CCCAAAGTGCTGGGATTACTT,pLKO.1,4202,CDS,90,100,5.625,2.8125,Y,126272,EID2B,CCGGCCCAAAGTGCTGGGATTACTTCTCGAGAAGTAATCCCAGCACTTTGGGTTTTTG,AATTCAAAAACCCAAAGTGCTGGGATTACTTCTCGAGAAGTAATCCCAGCACTTTGGG,n/a
human,7404,UTY,NM_182660.1,TRCN0000096242,NM_009483.1-581s1c1,GCTACGAATCTCTAATCTTAA,pLKO.1,1232,CDS,95,95,,,Y,22289,Kdm6a,CCGGGCTACGAATCTCTAATCTTAACTCGAGTTAAGATTAGAGATTCGTAGCTTTTTG,AATTCAAAAAGCTACGAATCTCTAATCTTAACTCGAGTTAAGATTAGAGATTCGTAGC,n/a
human,7404,UTY,NM_182660.1,TRCN0000331919,NM_009483.1-581s21c1,GCTACGAATCTCTAATCTTAA,pLKO_005,1232,CDS,95,95,,,Y,22289,Kdm6a,CCGGGCTACGAATCTCTAATCTTAACTCGAGTTAAGATTAGAGATTCGTAGCTTTTTG,AATTCAAAAAGCTACGAATCTCTAATCTTAACTCGAGTTAAGATTAGAGATTCGTAGC,n/a
human,7404,UTY,NM_182660.1,TRCN0000095070,NM_009484.1-809s1c1,GCACCATAATATGGATCTAAT,pLKO.1,1752,CDS,90,95,,,N,22290,Uty,CCGGGCACCATAATATGGATCTAATCTCGAGATTAGATCCATATTATGGTGCTTTTTG,AATTCAAAAAGCACCATAATATGGATCTAATCTCGAGATTAGATCCATATTATGGTGC,n/a
human,7404,UTY,NM_182660.1,TRCN0000095071,NM_009484.1-1113s1c1,GCCTGGATGGACTTAGGTATT,pLKO.1,2056,CDS,90,95,,,N,22290,Uty,CCGGGCCTGGATGGACTTAGGTATTCTCGAGAATACCTAAGTCCATCCAGGCTTTTTG,AATTCAAAAAGCCTGGATGGACTTAGGTATTCTCGAGAATACCTAAGTCCATCCAGGC,n/a
human,7404,UTY,NM_182660.1,TRCN0000095073,NM_009484.1-808s1c1,TGCACCATAATATGGATCTAA,pLKO.1,1751,CDS,90,95,,,N,22290,Uty,CCGGTGCACCATAATATGGATCTAACTCGAGTTAGATCCATATTATGGTGCATTTTTG,AATTCAAAAATGCACCATAATATGGATCTAACTCGAGTTAGATCCATATTATGGTGCA,n/a
human,7404,UTY,NM_182660.1,TRCN0000096243,NM_009483.1-2821s1c1,CCTTCTCCTAAGTCCACTGAA,pLKO.1,3328,CDS,90,95,,,N,22289,Kdm6a,CCGGCCTTCTCCTAAGTCCACTGAACTCGAGTTCAGTGGACTTAGGAGAAGGTTTTTG,AATTCAAAAACCTTCTCCTAAGTCCACTGAACTCGAGTTCAGTGGACTTAGGAGAAGG,n/a
human,7404,UTY,NM_182660.1,TRCN0000242894,NM_152499.1-235s21c1,CGCGAAGTGAAGAGGATTCTG,pLKO_005,1090,CDS,90,90,,,Y,149473,CCDC24,CCGGCGCGAAGTGAAGAGGATTCTGCTCGAGCAGAATCCTCTTCACTTCGCGTTTTTG,AATTCAAAAACGCGAAGTGAAGAGGATTCTGCTCGAGCAGAATCCTCTTCACTTCGCG,n/a
human,7404,UTY,NM_182660.1,TRCN0000162624,NM_020317.3-978s1c1,CCAGCAAAGAAGCATAGCTTT,pLKO.1,2323,CDS,81,90,,,Y,57035,RSRP1,CCGGCCAGCAAAGAAGCATAGCTTTCTCGAGAAAGCTATGCTTCTTTGCTGGTTTTTG,AATTCAAAAACCAGCAAAGAAGCATAGCTTTCTCGAGAAAGCTATGCTTCTTTGCTGG,n/a
human,7404,UTY,NM_182660.1,TRCN0000305301,NM_009483.1-778s21c1,GCATTTCAGTGGGCTATTAAA,pLKO_005,1429,CDS,90,89,,,Y,22289,Kdm6a,CCGGGCATTTCAGTGGGCTATTAAACTCGAGTTTAATAGCCCACTGAAATGCTTTTTG,AATTCAAAAAGCATTTCAGTGGGCTATTAAACTCGAGTTTAATAGCCCACTGAAATGC,n/a
human,7404,UTY,NM_182660.1,TRCN0000075284,NM_031213.2-887s1c1,CCACTGCAACATCTTCTCCTA,pLKO.1,3317,CDS,90,89,,,Y,81926,ABHD17A,CCGGCCACTGCAACATCTTCTCCTACTCGAGTAGGAGAAGATGTTGCAGTGGTTTTTG,AATTCAAAAACCACTGCAACATCTTCTCCTACTCGAGTAGGAGAAGATGTTGCAGTGG,n/a
human,7404,UTY,NM_182660.1,TRCN0000296309,NM_000950.2-1244s21c1,CCATTAACTTCTACCTAAATC,pLKO_005,2108,CDS,85,89,,,Y,5638,PRRG1,CCGGCCATTAACTTCTACCTAAATCCTCGAGGATTTAGGTAGAAGTTAATGGTTTTTG,AATTCAAAAACCATTAACTTCTACCTAAATCCTCGAGGATTTAGGTAGAAGTTAATGG,n/a
human,7404,UTY,NM_182660.1,TRCN0000003487,NM_000063.x-2208s1c1,GCCACGAGACTTTCACATCAA,pLKO.1,2216,CDS,85,89,,,Y,717,C2,CCGGGCCACGAGACTTTCACATCAACTCGAGTTGATGTGAAAGTCTCGTGGCTTTTTG,AATTCAAAAAGCCACGAGACTTTCACATCAACTCGAGTTGATGTGAAAGTCTCGTGGC,n/a
human,7404,UTY,NM_182660.1,TRCN0000134648,NM_021648.4-968s1c1,GCTGCAAATTCAAGTTCATCT,pLKO.1,1609,CDS,85,89,,,Y,23270,TSPYL4,CCGGGCTGCAAATTCAAGTTCATCTCTCGAGAGATGAACTTGAATTTGCAGCTTTTTG,AATTCAAAAAGCTGCAAATTCAAGTTCATCTCTCGAGAGATGAACTTGAATTTGCAGC,n/a
human,7404,UTY,NM_182660.1,TRCN0000036894,NM_016541.1-233s1c1,ACCTGATGAAGAACAACCCAT,pLKO.1,2811,CDS,85,89,,,Y,51764,GNG13,CCGGACCTGATGAAGAACAACCCATCTCGAGATGGGTTGTTCTTCATCAGGTTTTTTG,AATTCAAAAAACCTGATGAAGAACAACCCATCTCGAGATGGGTTGTTCTTCATCAGGT,n/a
human,7404,UTY,NM_182660.1,TRCN0000308263,NM_001834.2-385s21c1,CACAGTCAATGGAGATGTGTT,pLKO_005,3402,CDS,85,89,,,Y,1212,CLTB,CCGGCACAGTCAATGGAGATGTGTTCTCGAGAACACATCTCCATTGACTGTGTTTTTG,AATTCAAAAACACAGTCAATGGAGATGTGTTCTCGAGAACACATCTCCATTGACTGTG,n/a
human,7404,UTY,NM_182660.1,TRCN0000110899,NM_011166.1-355s1c1,GCCGGGTGTATTCCTTGTGAA,pLKO.1,2572,CDS,80,89,,,N,19111,Prl6a1,CCGGGCCGGGTGTATTCCTTGTGAACTCGAGTTCACAAGGAATACACCCGGCTTTTTG,AATTCAAAAAGCCGGGTGTATTCCTTGTGAACTCGAGTTCACAAGGAATACACCCGGC,n/a
human,7404,UTY,NM_182660.1,TRCN0000235568,NM_022767.3-195s21c1,CTTCCCTCACCATCCCAAATG,pLKO_005,4189,CDS,80,89,,,Y,64782,AEN,CCGGCTTCCCTCACCATCCCAAATGCTCGAGCATTTGGGATGGTGAGGGAAGTTTTTG,AATTCAAAAACTTCCCTCACCATCCCAAATGCTCGAGCATTTGGGATGGTGAGGGAAG,n/a
human,7404,UTY,NM_182660.1,TRCN0000218066,XM_001006405.1-986s21c1,ATGGTCTACTTCAACTACATG,pLKO_005,1408,CDS,80,89,,,Y,545793,AB010352,CCGGATGGTCTACTTCAACTACATGCTCGAGCATGTAGTTGAAGTAGACCATTTTTTG,AATTCAAAAAATGGTCTACTTCAACTACATGCTCGAGCATGTAGTTGAAGTAGACCAT,n/a
human,7404,UTY,NM_182660.1,TRCN0000142424,NM_015077.1-1770s1c1,GCAACTTTGTGTTGGTGCTAT,pLKO.1,719,5UTR,80,89,,,Y,23098,SARM1,CCGGGCAACTTTGTGTTGGTGCTATCTCGAGATAGCACCAACACAAAGTTGCTTTTTG,AATTCAAAAAGCAACTTTGTGTTGGTGCTATCTCGAGATAGCACCAACACAAAGTTGC,n/a
human,7404,UTY,NM_182660.1,TRCN0000107722,NM_004450.1-277s1c1,GCCTGGTTTACCGAGCTGATA,pLKO.1,68,5UTR,80,89,,,Y,2079,ERH,CCGGGCCTGGTTTACCGAGCTGATACTCGAGTATCAGCTCGGTAAACCAGGCTTTTTG,AATTCAAAAAGCCTGGTTTACCGAGCTGATACTCGAGTATCAGCTCGGTAAACCAGGC,n/a
human,7404,UTY,NM_182660.1,TRCN0000300269,NM_004450.2-277s21c1,GCCTGGTTTACCGAGCTGATA,pLKO_005,68,5UTR,80,89,,,Y,2079,ERH,CCGGGCCTGGTTTACCGAGCTGATACTCGAGTATCAGCTCGGTAAACCAGGCTTTTTG,AATTCAAAAAGCCTGGTTTACCGAGCTGATACTCGAGTATCAGCTCGGTAAACCAGGC,n/a
human,7404,UTY,NM_182660.1,TRCN0000018127,NM_015035.2-1943s1c1,GCGAAGTTGAACATCTCACAA,pLKO.1,2887,CDS,80,89,,,Y,23051,ZHX3,CCGGGCGAAGTTGAACATCTCACAACTCGAGTTGTGAGATGTTCAACTTCGCTTTTTG,AATTCAAAAAGCGAAGTTGAACATCTCACAACTCGAGTTGTGAGATGTTCAACTTCGC,n/a
human,7404,UTY,NM_182660.1,TRCN0000353580,NM_015035.3-1943s21c1,GCGAAGTTGAACATCTCACAA,pLKO_005,2887,CDS,80,89,,,Y,23051,ZHX3,CCGGGCGAAGTTGAACATCTCACAACTCGAGTTGTGAGATGTTCAACTTCGCTTTTTG,AATTCAAAAAGCGAAGTTGAACATCTCACAACTCGAGTTGTGAGATGTTCAACTTCGC,n/a
human,7404,UTY,NM_182660.1,TRCN0000158930,NM_003007.2-1330s1c1,GTAATTATAGAGCAGGAAGAT,pLKO.1,2636,CDS,80,89,,,Y,6406,SEMG1,CCGGGTAATTATAGAGCAGGAAGATCTCGAGATCTTCCTGCTCTATAATTACTTTTTG,AATTCAAAAAGTAATTATAGAGCAGGAAGATCTCGAGATCTTCCTGCTCTATAATTAC,n/a
human,7404,UTY,NM_182660.1,TRCN0000161599,NM_207385.1-227s1c1,GCTGAGACACAAAGAAGTTAA,pLKO.1,2379,CDS,80,89,,,Y,,,CCGGGCTGAGACACAAAGAAGTTAACTCGAGTTAACTTCTTTGTGTCTCAGCTTTTTG,AATTCAAAAAGCTGAGACACAAAGAAGTTAACTCGAGTTAACTTCTTTGTGTCTCAGC,n/a
human,7404,UTY,NM_182660.1,TRCN0000001680,NM_009915.x-684s1c1,CCTCTCTACCAGGAATCATAT,pLKO.1,3968,CDS,80,89,,,Y,12772,Ccr2,CCGGCCTCTCTACCAGGAATCATATCTCGAGATATGATTCCTGGTAGAGAGGTTTTTG,AATTCAAAAACCTCTCTACCAGGAATCATATCTCGAGATATGATTCCTGGTAGAGAGG,n/a
human,7404,UTY,NM_182660.1,TRCN0000013260,NM_003709.1-382s1c1,GCTACTTCTCAGCTTTACCAT,pLKO.1,3475,CDS,86,85,,,Y,8609,KLF7,CCGGGCTACTTCTCAGCTTTACCATCTCGAGATGGTAAAGCTGAGAAGTAGCTTTTTG,AATTCAAAAAGCTACTTCTCAGCTTTACCATCTCGAGATGGTAAAGCTGAGAAGTAGC,n/a
human,7404,UTY,NM_182660.1,TRCN0000048791,NM_002572.1-729s1c1,GCATGAACTGATCATGCAGTT,pLKO.1,27,5UTR,86,85,,,Y,5049,PAFAH1B2,CCGGGCATGAACTGATCATGCAGTTCTCGAGAACTGCATGATCAGTTCATGCTTTTTG,AATTCAAAAAGCATGAACTGATCATGCAGTTCTCGAGAACTGCATGATCAGTTCATGC,n/a
human,7404,UTY,NM_182660.1,TRCN0000313278,NM_133710.3-411s21c1,CAGCGCAACATCAGCCTAAAG,pLKO_005,1981,CDS,81,85,,,N,69274,Ctdspl,CCGGCAGCGCAACATCAGCCTAAAGCTCGAGCTTTAGGCTGATGTTGCGCTGTTTTTG,AATTCAAAAACAGCGCAACATCAGCCTAAAGCTCGAGCTTTAGGCTGATGTTGCGCTG,n/a
human,7404,UTY,NM_182660.1,TRCN0000245860,NM_001080441.1-132s21c1,TCAAGCACAGCTGGAACAGTC,pLKO_005,2330,CDS,81,85,,,Y,143941,TTC36,CCGGTCAAGCACAGCTGGAACAGTCCTCGAGGACTGTTCCAGCTGTGCTTGATTTTTG,AATTCAAAAATCAAGCACAGCTGGAACAGTCCTCGAGGACTGTTCCAGCTGTGCTTGA,n/a
human,7404,UTY,NM_182660.1,TRCN0000125468,NM_133710.1-492s1c1,CCAGCGCAACATCAGCCTAAA,pLKO.1,1980,CDS,77,85,,,Y,69274,Ctdspl,CCGGCCAGCGCAACATCAGCCTAAACTCGAGTTTAGGCTGATGTTGCGCTGGTTTTTG,AATTCAAAAACCAGCGCAACATCAGCCTAAACTCGAGTTTAGGCTGATGTTGCGCTGG,n/a
