Taxon,"Gene ID","Gene Symbol",Transcript,"Clone ID","Legacy Clone Name","Target Seq",Vector,"Match Position","Match Region","Match %","SDR Match %","Intrinsic Score","Adjusted Score","Matches Other Gene in Same Taxon?","Orig. Target Gene ID","Orig. Target Gene Symbol","Forward Oligo Sequence","Reverse Oligo Sequence",Addgene
human,8837,CFLAR,NR_147241.1,TRCN0000364098,NM_003879.4-888s21c1,CCAGATCAACTGGATTTATTA,pLKO_005,533,3UTR,100,100,15,21,N,8837,CFLAR,CCGGCCAGATCAACTGGATTTATTACTCGAGTAATAAATCCAGTTGATCTGGTTTTTG,AATTCAAAAACCAGATCAACTGGATTTATTACTCGAGTAATAAATCCAGTTGATCTGG,n/a
human,8837,CFLAR,NR_147241.1,TRCN0000320749,NM_003879.4-751s21c1,TTGGTGAGGATTTGGATAAAT,pLKO_005,396,3UTR,100,100,15,10.5,N,8837,CFLAR,CCGGTTGGTGAGGATTTGGATAAATCTCGAGATTTATCCAAATCCTCACCAATTTTTG,AATTCAAAAATTGGTGAGGATTTGGATAAATCTCGAGATTTATCCAAATCCTCACCAA,n/a
human,8837,CFLAR,NR_147241.1,TRCN0000378209,NM_003879.4-808s21c1,ACATGGGCCGAGGCAAGATAA,pLKO_005,453,3UTR,100,100,13.2,9.24,N,8837,CFLAR,CCGGACATGGGCCGAGGCAAGATAACTCGAGTTATCTTGCCTCGGCCCATGTTTTTTG,AATTCAAAAAACATGGGCCGAGGCAAGATAACTCGAGTTATCTTGCCTCGGCCCATGT,n/a
human,8837,CFLAR,NR_147241.1,TRCN0000031007,NM_009805.1-562s1c1,GCCTGAAGAACATCCACAGAA,pLKO.1,561,3UTR,95,95,,,N,12633,Cflar,CCGGGCCTGAAGAACATCCACAGAACTCGAGTTCTGTGGATGTTCTTCAGGCTTTTTG,AATTCAAAAAGCCTGAAGAACATCCACAGAACTCGAGTTCTGTGGATGTTCTTCAGGC,n/a
human,8837,CFLAR,NR_147241.1,TRCN0000301211,NM_009805.4-984s21c1,GCCTGAAGAACATCCACAGAA,pLKO_005,561,3UTR,95,95,,,N,12633,Cflar,CCGGGCCTGAAGAACATCCACAGAACTCGAGTTCTGTGGATGTTCTTCAGGCTTTTTG,AATTCAAAAAGCCTGAAGAACATCCACAGAACTCGAGTTCTGTGGATGTTCTTCAGGC,n/a
human,8837,CFLAR,NR_147241.1,TRCN0000375017,NM_007984.2-1220s21c1,TTCCTCATGAAGCTGATTAAC,pLKO_005,437,3UTR,80,89,,,Y,14086,Fscn1,CCGGTTCCTCATGAAGCTGATTAACCTCGAGGTTAATCAGCTTCATGAGGAATTTTTG,AATTCAAAAATTCCTCATGAAGCTGATTAACCTCGAGGTTAATCAGCTTCATGAGGAA,n/a
human,8837,CFLAR,NR_147241.1,TRCN0000173725,NM_025558.2-370s1c1,CAAGGATCCTTCCAAGAACAA,pLKO.1,679,3UTR,80,89,,,Y,66427,Cyb5b,CCGGCAAGGATCCTTCCAAGAACAACTCGAGTTGTTCTTGGAAGGATCCTTGTTTTTG,AATTCAAAAACAAGGATCCTTCCAAGAACAACTCGAGTTGTTCTTGGAAGGATCCTTG,n/a
human,8837,CFLAR,NR_147241.1,TRCN0000314303,NM_025558.5-369s21c1,CAAGGATCCTTCCAAGAACAA,pLKO_005,679,3UTR,80,89,,,Y,66427,Cyb5b,CCGGCAAGGATCCTTCCAAGAACAACTCGAGTTGTTCTTGGAAGGATCCTTGTTTTTG,AATTCAAAAACAAGGATCCTTCCAAGAACAACTCGAGTTGTTCTTGGAAGGATCCTTG,n/a
