Taxon,"Gene ID","Gene Symbol",Transcript,"Clone ID","Legacy Clone Name","Target Seq",Vector,"Match Position","Match Region","Match %","SDR Match %","Intrinsic Score","Adjusted Score","Matches Other Gene in Same Taxon?","Orig. Target Gene ID","Orig. Target Gene Symbol","Forward Oligo Sequence","Reverse Oligo Sequence",Addgene
mouse,12662,Chm,XM_006528381.3,TRCN0000088921,NM_018818.1-1634s1c1,CCAGAAATTGTTTACTCCATA,pLKO.1,1451,CDS,100,100,4.95,6.93,N,12662,Chm,CCGGCCAGAAATTGTTTACTCCATACTCGAGTATGGAGTAAACAATTTCTGGTTTTTG,AATTCAAAAACCAGAAATTGTTTACTCCATACTCGAGTATGGAGTAAACAATTTCTGG,n/a
mouse,12662,Chm,XM_006528381.3,TRCN0000303135,NM_018818.2-1625s21c1,CCAGAAATTGTTTACTCCATA,pLKO_005,1451,CDS,100,100,4.95,6.93,N,12662,Chm,CCGGCCAGAAATTGTTTACTCCATACTCGAGTATGGAGTAAACAATTTCTGGTTTTTG,AATTCAAAAACCAGAAATTGTTTACTCCATACTCGAGTATGGAGTAAACAATTTCTGG,n/a
mouse,12662,Chm,XM_006528381.3,TRCN0000088918,NM_018818.1-3362s1c1,GCCAGGTTTCAGCGATGTTAA,pLKO.1,3183,3UTR,100,100,13.2,10.56,N,12662,Chm,CCGGGCCAGGTTTCAGCGATGTTAACTCGAGTTAACATCGCTGAAACCTGGCTTTTTG,AATTCAAAAAGCCAGGTTTCAGCGATGTTAACTCGAGTTAACATCGCTGAAACCTGGC,n/a
mouse,12662,Chm,XM_006528381.3,TRCN0000303210,NM_018818.2-3357s21c1,GCCAGGTTTCAGCGATGTTAA,pLKO_005,3183,3UTR,100,100,13.2,10.56,N,12662,Chm,CCGGGCCAGGTTTCAGCGATGTTAACTCGAGTTAACATCGCTGAAACCTGGCTTTTTG,AATTCAAAAAGCCAGGTTTCAGCGATGTTAACTCGAGTTAACATCGCTGAAACCTGGC,n/a
mouse,12662,Chm,XM_006528381.3,TRCN0000065179,NM_000390.1-1129s1c1,CGGTATGGCAACACTCCATTT,pLKO.1,978,CDS,100,100,10.8,8.64,N,1121,CHM,CCGGCGGTATGGCAACACTCCATTTCTCGAGAAATGGAGTGTTGCCATACCGTTTTTG,AATTCAAAAACGGTATGGCAACACTCCATTTCTCGAGAAATGGAGTGTTGCCATACCG,n/a
mouse,12662,Chm,XM_006528381.3,TRCN0000088920,NM_018818.1-1794s1c1,CCTGACTGTAATCTAGGAAAT,pLKO.1,1611,CDS,100,100,10.8,7.56,N,12662,Chm,CCGGCCTGACTGTAATCTAGGAAATCTCGAGATTTCCTAGATTACAGTCAGGTTTTTG,AATTCAAAAACCTGACTGTAATCTAGGAAATCTCGAGATTTCCTAGATTACAGTCAGG,n/a
mouse,12662,Chm,XM_006528381.3,TRCN0000088919,NM_018818.1-733s1c1,GCCGAAGATTTAACATTGATT,pLKO.1,550,CDS,100,100,5.625,3.9375,N,12662,Chm,CCGGGCCGAAGATTTAACATTGATTCTCGAGAATCAATGTTAAATCTTCGGCTTTTTG,AATTCAAAAAGCCGAAGATTTAACATTGATTCTCGAGAATCAATGTTAAATCTTCGGC,n/a
mouse,12662,Chm,XM_006528381.3,TRCN0000315473,NM_018818.2-724s21c1,GCCGAAGATTTAACATTGATT,pLKO_005,550,CDS,100,100,5.625,3.9375,N,12662,Chm,CCGGGCCGAAGATTTAACATTGATTCTCGAGAATCAATGTTAAATCTTCGGCTTTTTG,AATTCAAAAAGCCGAAGATTTAACATTGATTCTCGAGAATCAATGTTAAATCTTCGGC,n/a
mouse,12662,Chm,XM_006528381.3,TRCN0000088922,NM_018818.1-579s1c1,CCACAAGTAAATGATGCTGAA,pLKO.1,396,CDS,100,100,4.05,2.835,N,12662,Chm,CCGGCCACAAGTAAATGATGCTGAACTCGAGTTCAGCATCATTTACTTGTGGTTTTTG,AATTCAAAAACCACAAGTAAATGATGCTGAACTCGAGTTCAGCATCATTTACTTGTGG,n/a
mouse,12662,Chm,XM_006528381.3,TRCN0000303208,NM_018818.2-570s21c1,CCACAAGTAAATGATGCTGAA,pLKO_005,396,CDS,100,100,4.05,2.835,N,12662,Chm,CCGGCCACAAGTAAATGATGCTGAACTCGAGTTCAGCATCATTTACTTGTGGTTTTTG,AATTCAAAAACCACAAGTAAATGATGCTGAACTCGAGTTCAGCATCATTTACTTGTGG,n/a
mouse,12662,Chm,XM_006528381.3,TRCN0000065182,NM_000390.1-63s1c1,GATCGTAATAGGGACGGGTTT,pLKO.1,83,CDS,95,100,4.05,5.67,N,1121,CHM,CCGGGATCGTAATAGGGACGGGTTTCTCGAGAAACCCGTCCCTATTACGATCTTTTTG,AATTCAAAAAGATCGTAATAGGGACGGGTTTCTCGAGAAACCCGTCCCTATTACGATC,n/a
mouse,12662,Chm,XM_006528381.3,TRCN0000080888,XM_140740.5-2094s1c1,CCTTGGACTTTGGTGTGATTT,pLKO.1,66,CDS,81,90,,,N,240672,Dusp5,CCGGCCTTGGACTTTGGTGTGATTTCTCGAGAAATCACACCAAAGTCCAAGGTTTTTG,AATTCAAAAACCTTGGACTTTGGTGTGATTTCTCGAGAAATCACACCAAAGTCCAAGG,n/a
mouse,12662,Chm,XM_006528381.3,TRCN0000245182,NM_000390.2-1524s21c1,ATGCATGAAAGGCACCTATTT,pLKO_005,1373,CDS,90,89,,,Y,1121,CHM,CCGGATGCATGAAAGGCACCTATTTCTCGAGAAATAGGTGCCTTTCATGCATTTTTTG,AATTCAAAAAATGCATGAAAGGCACCTATTTCTCGAGAAATAGGTGCCTTTCATGCAT,n/a
mouse,12662,Chm,XM_006528381.3,TRCN0000057414,NM_007360.1-564s1c1,GCTGTATTCCTAAACTCATTA,pLKO.1,2816,3UTR,90,89,,,Y,22914,KLRK1,CCGGGCTGTATTCCTAAACTCATTACTCGAGTAATGAGTTTAGGAATACAGCTTTTTG,AATTCAAAAAGCTGTATTCCTAAACTCATTACTCGAGTAATGAGTTTAGGAATACAGC,n/a
mouse,12662,Chm,XM_006528381.3,TRCN0000069927,XM_195668.2-214s1c1,GCCAACACAGAGACCACCAAA,pLKO.1,492,CDS,90,89,,,Y,269990,LOC269990,CCGGGCCAACACAGAGACCACCAAACTCGAGTTTGGTGGTCTCTGTGTTGGCTTTTTG,AATTCAAAAAGCCAACACAGAGACCACCAAACTCGAGTTTGGTGGTCTCTGTGTTGGC,n/a
mouse,12662,Chm,XM_006528381.3,TRCN0000122883,NM_145058.1-1111s1c1,GCAGAACTAGACACCCTTGAA,pLKO.1,3720,3UTR,85,89,,,N,196383,RILPL2,CCGGGCAGAACTAGACACCCTTGAACTCGAGTTCAAGGGTGTCTAGTTCTGCTTTTTG,AATTCAAAAAGCAGAACTAGACACCCTTGAACTCGAGTTCAAGGGTGTCTAGTTCTGC,n/a
mouse,12662,Chm,XM_006528381.3,TRCN0000381621,NM_021350.2-1192s21c1,GTCTATTGTCTTCGCCATAAA,pLKO_005,1068,CDS,85,89,,,Y,12663,Chml,CCGGGTCTATTGTCTTCGCCATAAACTCGAGTTTATGGCGAAGACAATAGACTTTTTG,AATTCAAAAAGTCTATTGTCTTCGCCATAAACTCGAGTTTATGGCGAAGACAATAGAC,n/a
mouse,12662,Chm,XM_006528381.3,TRCN0000435994,NM_198580.1-1996s21c1,GTTCCTCTACTGGCCACAAAC,pLKO_005,2889,3UTR,85,89,,,Y,376497,SLC27A1,CCGGGTTCCTCTACTGGCCACAAACCTCGAGGTTTGTGGCCAGTAGAGGAACTTTTTG,AATTCAAAAAGTTCCTCTACTGGCCACAAACCTCGAGGTTTGTGGCCAGTAGAGGAAC,n/a
mouse,12662,Chm,XM_006528381.3,TRCN0000094636,NM_178685.3-2958s1c1,CCAGTGGATATTTCTAACATT,pLKO.1,4395,3UTR,85,89,,,Y,219257,Pcdh20,CCGGCCAGTGGATATTTCTAACATTCTCGAGAATGTTAGAAATATCCACTGGTTTTTG,AATTCAAAAACCAGTGGATATTTCTAACATTCTCGAGAATGTTAGAAATATCCACTGG,n/a
mouse,12662,Chm,XM_006528381.3,TRCN0000143338,NM_015931.1-909s1c1,GAAGAAGCTGTTGCACTTCAT,pLKO.1,189,CDS,85,89,,,Y,51066,SSUH2,CCGGGAAGAAGCTGTTGCACTTCATCTCGAGATGAAGTGCAACAGCTTCTTCTTTTTG,AATTCAAAAAGAAGAAGCTGTTGCACTTCATCTCGAGATGAAGTGCAACAGCTTCTTC,n/a
mouse,12662,Chm,XM_006528381.3,TRCN0000054376,NM_146093.1-398s1c1,GAGAAGCTTTAGAACGAGAAA,pLKO.1,1429,CDS,85,89,,,Y,225896,Ubxn1,CCGGGAGAAGCTTTAGAACGAGAAACTCGAGTTTCTCGTTCTAAAGCTTCTCTTTTTG,AATTCAAAAAGAGAAGCTTTAGAACGAGAAACTCGAGTTTCTCGTTCTAAAGCTTCTC,n/a
mouse,12662,Chm,XM_006528381.3,TRCN0000302297,NM_146093.1-398s21c1,GAGAAGCTTTAGAACGAGAAA,pLKO_005,1429,CDS,85,89,,,Y,225896,Ubxn1,CCGGGAGAAGCTTTAGAACGAGAAACTCGAGTTTCTCGTTCTAAAGCTTCTCTTTTTG,AATTCAAAAAGAGAAGCTTTAGAACGAGAAACTCGAGTTTCTCGTTCTAAAGCTTCTC,n/a
mouse,12662,Chm,XM_006528381.3,TRCN0000101618,NM_027669.1-655s1c1,CTGACCATTGAAGAACGAGAT,pLKO.1,3258,3UTR,85,89,,,Y,71089,Sept12,CCGGCTGACCATTGAAGAACGAGATCTCGAGATCTCGTTCTTCAATGGTCAGTTTTTG,AATTCAAAAACTGACCATTGAAGAACGAGATCTCGAGATCTCGTTCTTCAATGGTCAG,n/a
mouse,12662,Chm,XM_006528381.3,TRCN0000128529,NM_025103.1-736s1c1,CGAAGAAGAAATTGAACAGGA,pLKO.1,1481,CDS,85,89,,,Y,80173,IFT74,CCGGCGAAGAAGAAATTGAACAGGACTCGAGTCCTGTTCAATTTCTTCTTCGTTTTTG,AATTCAAAAACGAAGAAGAAATTGAACAGGACTCGAGTCCTGTTCAATTTCTTCTTCG,n/a
mouse,12662,Chm,XM_006528381.3,TRCN0000080523,NM_009258.2-529s1c1,CCTGCTGAGTTTAGCAGGTAA,pLKO.1,2069,3UTR,85,89,,,Y,20730,Spink1,CCGGCCTGCTGAGTTTAGCAGGTAACTCGAGTTACCTGCTAAACTCAGCAGGTTTTTG,AATTCAAAAACCTGCTGAGTTTAGCAGGTAACTCGAGTTACCTGCTAAACTCAGCAGG,n/a
mouse,12662,Chm,XM_006528381.3,TRCN0000119916,NM_027891.1-1919s1c1,GCAGTGTCATAGCAGAAACAA,pLKO.1,1762,CDS,85,89,,,Y,71735,Lrwd1,CCGGGCAGTGTCATAGCAGAAACAACTCGAGTTGTTTCTGCTATGACACTGCTTTTTG,AATTCAAAAAGCAGTGTCATAGCAGAAACAACTCGAGTTGTTTCTGCTATGACACTGC,n/a
mouse,12662,Chm,XM_006528381.3,TRCN0000430975,NM_014547.3-1623s21c1,TGCTGGTATCAGAATTGTTAT,pLKO_005,4173,3UTR,85,89,,,Y,29766,TMOD3,CCGGTGCTGGTATCAGAATTGTTATCTCGAGATAACAATTCTGATACCAGCATTTTTG,AATTCAAAAATGCTGGTATCAGAATTGTTATCTCGAGATAACAATTCTGATACCAGCA,n/a
mouse,12662,Chm,XM_006528381.3,TRCN0000143415,NM_032130.1-1135s1c1,CCCAAGGAAAGAAACAGTCAT,pLKO.1,1794,CDS,85,89,,,Y,84070,FAM186B,CCGGCCCAAGGAAAGAAACAGTCATCTCGAGATGACTGTTTCTTTCCTTGGGTTTTTG,AATTCAAAAACCCAAGGAAAGAAACAGTCATCTCGAGATGACTGTTTCTTTCCTTGGG,n/a
mouse,12662,Chm,XM_006528381.3,TRCN0000263240,NM_001099280.1-1379s21c1,GCAGCACTAACACCAGAATAA,pLKO_005,2708,3UTR,80,89,,,N,727957,MROH1,CCGGGCAGCACTAACACCAGAATAACTCGAGTTATTCTGGTGTTAGTGCTGCTTTTTG,AATTCAAAAAGCAGCACTAACACCAGAATAACTCGAGTTATTCTGGTGTTAGTGCTGC,n/a
mouse,12662,Chm,XM_006528381.3,TRCN0000118085,NM_018094.2-1457s1c1,CCAAACTTCAACAGATCAATT,pLKO.1,2493,3UTR,80,89,,,Y,23708,GSPT2,CCGGCCAAACTTCAACAGATCAATTCTCGAGAATTGATCTGTTGAAGTTTGGTTTTTG,AATTCAAAAACCAAACTTCAACAGATCAATTCTCGAGAATTGATCTGTTGAAGTTTGG,n/a
mouse,12662,Chm,XM_006528381.3,TRCN0000291292,NM_018094.3-1487s21c1,CCAAACTTCAACAGATCAATT,pLKO_005,2493,3UTR,80,89,,,Y,23708,GSPT2,CCGGCCAAACTTCAACAGATCAATTCTCGAGAATTGATCTGTTGAAGTTTGGTTTTTG,AATTCAAAAACCAAACTTCAACAGATCAATTCTCGAGAATTGATCTGTTGAAGTTTGG,n/a
mouse,12662,Chm,XM_006528381.3,TRCN0000192959,NM_001005247.1-4396s1c1,GCCTCCTGAATGTTAGAATTA,pLKO.1,3653,3UTR,80,89,,,Y,246694,Hps5,CCGGGCCTCCTGAATGTTAGAATTACTCGAGTAATTCTAACATTCAGGAGGCTTTTTG,AATTCAAAAAGCCTCCTGAATGTTAGAATTACTCGAGTAATTCTAACATTCAGGAGGC,n/a
mouse,12662,Chm,XM_006528381.3,TRCN0000112384,NM_026775.2-249s1c1,ACCCACCTCAAGATCACAGAT,pLKO.1,2763,3UTR,80,89,,,Y,68581,Tmed10,CCGGACCCACCTCAAGATCACAGATCTCGAGATCTGTGATCTTGAGGTGGGTTTTTTG,AATTCAAAAAACCCACCTCAAGATCACAGATCTCGAGATCTGTGATCTTGAGGTGGGT,n/a
mouse,12662,Chm,XM_006528381.3,TRCN0000373179,NM_022341.1-986s21c1,AGTGGACATTTCCTAACAATT,pLKO_005,4397,3UTR,80,89,,,Y,64146,PDF,CCGGAGTGGACATTTCCTAACAATTCTCGAGAATTGTTAGGAAATGTCCACTTTTTTG,AATTCAAAAAAGTGGACATTTCCTAACAATTCTCGAGAATTGTTAGGAAATGTCCACT,n/a
mouse,12662,Chm,XM_006528381.3,TRCN0000046064,NM_182701.1-375s1c1,CCAGGAACAAACTCAGAAATA,pLKO.1,1773,CDS,80,89,,,Y,257202,GPX6,CCGGCCAGGAACAAACTCAGAAATACTCGAGTATTTCTGAGTTTGTTCCTGGTTTTTG,AATTCAAAAACCAGGAACAAACTCAGAAATACTCGAGTATTTCTGAGTTTGTTCCTGG,n/a
mouse,12662,Chm,XM_006528381.3,TRCN0000002710,NM_144714.x-950s1c1,AGAGAAGAATACACAGCAATA,pLKO.1,2514,3UTR,80,89,,,Y,151649,PP2D1,CCGGAGAGAAGAATACACAGCAATACTCGAGTATTGCTGTGTATTCTTCTCTTTTTTG,AATTCAAAAAAGAGAAGAATACACAGCAATACTCGAGTATTGCTGTGTATTCTTCTCT,n/a
mouse,12662,Chm,XM_006528381.3,TRCN0000145184,NM_032382.2-2310s1c1,GAGTGGACATTTCCTAACAAT,pLKO.1,4396,3UTR,80,89,,,Y,84342,COG8,CCGGGAGTGGACATTTCCTAACAATCTCGAGATTGTTAGGAAATGTCCACTCTTTTTG,AATTCAAAAAGAGTGGACATTTCCTAACAATCTCGAGATTGTTAGGAAATGTCCACTC,n/a
mouse,12662,Chm,XM_006528381.3,TRCN0000072690,NM_016485.3-707s1c1,GCACAGGTGTAGCAAGTAATA,pLKO.1,2922,3UTR,86,85,,,Y,51534,VTA1,CCGGGCACAGGTGTAGCAAGTAATACTCGAGTATTACTTGCTACACCTGTGCTTTTTG,AATTCAAAAAGCACAGGTGTAGCAAGTAATACTCGAGTATTACTTGCTACACCTGTGC,n/a
mouse,12662,Chm,XM_006528381.3,TRCN0000376433,NM_003375.2-1212s21c1,TCTAGTTGGTTATCTAGTTAC,pLKO_005,4484,3UTR,81,85,,,Y,7417,VDAC2,CCGGTCTAGTTGGTTATCTAGTTACCTCGAGGTAACTAGATAACCAACTAGATTTTTG,AATTCAAAAATCTAGTTGGTTATCTAGTTACCTCGAGGTAACTAGATAACCAACTAGA,n/a
mouse,12662,Chm,XM_006528381.3,TRCN0000362004,NM_183016.1-1032s21c1,ACCTTATCCAGAGACTAATAT,pLKO_005,2575,3UTR,81,85,,,Y,217866,Cdc42bpb,CCGGACCTTATCCAGAGACTAATATCTCGAGATATTAGTCTCTGGATAAGGTTTTTTG,AATTCAAAAAACCTTATCCAGAGACTAATATCTCGAGATATTAGTCTCTGGATAAGGT,n/a
mouse,12662,Chm,XM_006528381.3,TRCN0000022037,NM_002913.3-2520s1c1,CCTCCAGCTATGAATGAAATA,pLKO.1,2652,3UTR,81,85,,,Y,5981,RFC1,CCGGCCTCCAGCTATGAATGAAATACTCGAGTATTTCATTCATAGCTGGAGGTTTTTG,AATTCAAAAACCTCCAGCTATGAATGAAATACTCGAGTATTTCATTCATAGCTGGAGG,n/a
mouse,12662,Chm,XM_006528381.3,TRCN0000082344,NM_013922.2-1788s1c1,CCTTACTCCATATCAGAAATT,pLKO.1,1460,CDS,81,85,,,Y,30944,Zfp354c,CCGGCCTTACTCCATATCAGAAATTCTCGAGAATTTCTGATATGGAGTAAGGTTTTTG,AATTCAAAAACCTTACTCCATATCAGAAATTCTCGAGAATTTCTGATATGGAGTAAGG,n/a
mouse,12662,Chm,XM_006528381.3,TRCN0000094480,NM_029467.2-1074s1c1,CCACCAATCCTGGAGATAGAA,pLKO.1,1701,CDS,81,85,,,Y,75870,Tcam1,CCGGCCACCAATCCTGGAGATAGAACTCGAGTTCTATCTCCAGGATTGGTGGTTTTTG,AATTCAAAAACCACCAATCCTGGAGATAGAACTCGAGTTCTATCTCCAGGATTGGTGG,n/a
mouse,12662,Chm,XM_006528381.3,TRCN0000136561,XM_378283.1-1375s1c1,CCAGTTGTTCTCAGGATTTGT,pLKO.1,156,CDS,81,85,,,Y,,,CCGGCCAGTTGTTCTCAGGATTTGTCTCGAGACAAATCCTGAGAACAACTGGTTTTTG,AATTCAAAAACCAGTTGTTCTCAGGATTTGTCTCGAGACAAATCCTGAGAACAACTGG,n/a
mouse,12662,Chm,XM_006528381.3,TRCN0000165107,NM_024771.1-1613s1c1,CCAGAGGTTCTGCTTGTTCTT,pLKO.1,143,CDS,81,85,,,Y,79829,NAA40,CCGGCCAGAGGTTCTGCTTGTTCTTCTCGAGAAGAACAAGCAGAACCTCTGGTTTTTG,AATTCAAAAACCAGAGGTTCTGCTTGTTCTTCTCGAGAAGAACAAGCAGAACCTCTGG,n/a
mouse,12662,Chm,XM_006528381.3,TRCN0000044790,NM_003471.2-730s1c1,GCTGTCAAGAAAGCATATTAT,pLKO.1,4319,3UTR,77,85,,,Y,7881,KCNAB1,CCGGGCTGTCAAGAAAGCATATTATCTCGAGATAATATGCTTTCTTGACAGCTTTTTG,AATTCAAAAAGCTGTCAAGAAAGCATATTATCTCGAGATAATATGCTTTCTTGACAGC,n/a
mouse,12662,Chm,XM_006528381.3,TRCN0000069326,NM_010597.2-881s1c1,CTGTCAAGAAAGCATATCATT,pLKO.1,4320,3UTR,77,85,,,Y,16497,Kcnab1,CCGGCTGTCAAGAAAGCATATCATTCTCGAGAATGATATGCTTTCTTGACAGTTTTTG,AATTCAAAAACTGTCAAGAAAGCATATCATTCTCGAGAATGATATGCTTTCTTGACAG,n/a
mouse,12662,Chm,XM_006528381.3,TRCN0000135197,XM_378283.1-1376s1c1,CAGTTGTTCTCAGGATTTGTT,pLKO.1,157,CDS,77,85,,,Y,,,CCGGCAGTTGTTCTCAGGATTTGTTCTCGAGAACAAATCCTGAGAACAACTGTTTTTG,AATTCAAAAACAGTTGTTCTCAGGATTTGTTCTCGAGAACAAATCCTGAGAACAACTG,n/a
mouse,12662,Chm,XM_006528381.3,TRCN0000123072,NM_006990.2-571s1c1,CCTGTCTTAGAAACATACAAT,pLKO.1,4319,3UTR,77,85,,,Y,10163,WASF2,CCGGCCTGTCTTAGAAACATACAATCTCGAGATTGTATGTTTCTAAGACAGGTTTTTG,AATTCAAAAACCTGTCTTAGAAACATACAATCTCGAGATTGTATGTTTCTAAGACAGG,n/a
mouse,12662,Chm,XM_006528381.3,TRCN0000060685,NM_032832.3-1343s1c1,GATGAAGACTTCTGCCAGAAT,pLKO.1,1680,CDS,77,85,,,Y,84918,LRP11,CCGGGATGAAGACTTCTGCCAGAATCTCGAGATTCTGGCAGAAGTCTTCATCTTTTTG,AATTCAAAAAGATGAAGACTTCTGCCAGAATCTCGAGATTCTGGCAGAAGTCTTCATC,n/a
