Taxon,"Gene ID","Gene Symbol",Transcript,"Clone ID","Legacy Clone Name","Target Seq",Vector,"Match Position","Match Region","Match %","SDR Match %","Intrinsic Score","Adjusted Score","Matches Other Gene in Same Taxon?","Orig. Target Gene ID","Orig. Target Gene Symbol","Forward Oligo Sequence","Reverse Oligo Sequence",Addgene
mouse,14747,Cmklr1,XM_006530164.3,TRCN0000027859,NM_008153.1-510s1c1,CGACTTCCTGTTCAACATCTT,pLKO.1,762,CDS,100,100,4.95,6.93,N,14747,Cmklr1,CCGGCGACTTCCTGTTCAACATCTTCTCGAGAAGATGTTGAACAGGAAGTCGTTTTTG,AATTCAAAAACGACTTCCTGTTCAACATCTTCTCGAGAAGATGTTGAACAGGAAGTCG,n/a
mouse,14747,Cmklr1,XM_006530164.3,TRCN0000027923,NM_008153.1-799s1c1,GCCAACATTCATGGGAAGATA,pLKO.1,1051,CDS,100,100,5.625,4.5,N,14747,Cmklr1,CCGGGCCAACATTCATGGGAAGATACTCGAGTATCTTCCCATGAATGTTGGCTTTTTG,AATTCAAAAAGCCAACATTCATGGGAAGATACTCGAGTATCTTCCCATGAATGTTGGC,n/a
mouse,14747,Cmklr1,XM_006530164.3,TRCN0000027931,NM_008153.1-1328s1c1,CGTCTTTGAATGAGAAGGCTT,pLKO.1,1580,CDS,100,100,2.64,1.848,N,14747,Cmklr1,CCGGCGTCTTTGAATGAGAAGGCTTCTCGAGAAGCCTTCTCATTCAAAGACGTTTTTG,AATTCAAAAACGTCTTTGAATGAGAAGGCTTCTCGAGAAGCCTTCTCATTCAAAGACG,n/a
mouse,14747,Cmklr1,XM_006530164.3,TRCN0000027892,NM_008153.1-321s1c1,CTTTGGCTACTTTGTGGACTT,pLKO.1,573,CDS,100,100,4.05,2.43,N,14747,Cmklr1,CCGGCTTTGGCTACTTTGTGGACTTCTCGAGAAGTCCACAAAGTAGCCAAAGTTTTTG,AATTCAAAAACTTTGGCTACTTTGTGGACTTCTCGAGAAGTCCACAAAGTAGCCAAAG,n/a
mouse,14747,Cmklr1,XM_006530164.3,TRCN0000027890,NM_008153.1-879s1c1,GCAAGTAGTTTCCACAGGGTA,pLKO.1,1131,CDS,100,100,2.64,1.584,N,14747,Cmklr1,CCGGGCAAGTAGTTTCCACAGGGTACTCGAGTACCCTGTGGAAACTACTTGCTTTTTG,AATTCAAAAAGCAAGTAGTTTCCACAGGGTACTCGAGTACCCTGTGGAAACTACTTGC,n/a
mouse,14747,Cmklr1,XM_006530164.3,TRCN0000363171,NM_016568.2-805s21c1,TTCGGCAAGGCCATGTGTAAG,pLKO_005,829,CDS,90,89,,,Y,51289,RXFP3,CCGGTTCGGCAAGGCCATGTGTAAGCTCGAGCTTACACATGGCCTTGCCGAATTTTTG,AATTCAAAAATTCGGCAAGGCCATGTGTAAGCTCGAGCTTACACATGGCCTTGCCGAA,n/a
mouse,14747,Cmklr1,XM_006530164.3,TRCN0000024671,NM_009872.1-214s1c1,GCCTCGGCCAAGAAGAAGAAA,pLKO.1,1262,CDS,85,89,,,Y,12570,Cdk5r2,CCGGGCCTCGGCCAAGAAGAAGAAACTCGAGTTTCTTCTTCTTGGCCGAGGCTTTTTG,AATTCAAAAAGCCTCGGCCAAGAAGAAGAAACTCGAGTTTCTTCTTCTTGGCCGAGGC,n/a
mouse,14747,Cmklr1,XM_006530164.3,TRCN0000141326,NM_139170.2-780s1c1,CAGACAGAACACAAGGACAAA,pLKO.1,67,5UTR,85,89,,,Y,146562,C16orf71,CCGGCAGACAGAACACAAGGACAAACTCGAGTTTGTCCTTGTGTTCTGTCTGTTTTTG,AATTCAAAAACAGACAGAACACAAGGACAAACTCGAGTTTGTCCTTGTGTTCTGTCTG,n/a
mouse,14747,Cmklr1,XM_006530164.3,TRCN0000054245,NM_080388.1-191s1c1,CAGCCTGGTCAAGAACAAGAT,pLKO.1,1260,CDS,85,89,,,Y,140576,S100A16,CCGGCAGCCTGGTCAAGAACAAGATCTCGAGATCTTGTTCTTGACCAGGCTGTTTTTG,AATTCAAAAACAGCCTGGTCAAGAACAAGATCTCGAGATCTTGTTCTTGACCAGGCTG,n/a
mouse,14747,Cmklr1,XM_006530164.3,TRCN0000098699,NM_172434.1-375s1c1,CTTCGAGCTGACTGTCATCAA,pLKO.1,891,CDS,85,89,,,Y,78784,Celf3,CCGGCTTCGAGCTGACTGTCATCAACTCGAGTTGATGACAGTCAGCTCGAAGTTTTTG,AATTCAAAAACTTCGAGCTGACTGTCATCAACTCGAGTTGATGACAGTCAGCTCGAAG,n/a
mouse,14747,Cmklr1,XM_006530164.3,TRCN0000356450,NM_002030.3-1077s21c1,ACCCAATTCTCTACGTCTTTA,pLKO_005,1445,CDS,85,89,,,Y,2359,FPR3,CCGGACCCAATTCTCTACGTCTTTACTCGAGTAAAGACGTAGAGAATTGGGTTTTTTG,AATTCAAAAAACCCAATTCTCTACGTCTTTACTCGAGTAAAGACGTAGAGAATTGGGT,n/a
mouse,14747,Cmklr1,XM_006530164.3,TRCN0000016490,NM_145805.1-783s1c1,CCGCGTCTGGTTCCAGAACAA,pLKO.1,939,CDS,85,89,,,Y,64843,ISL2,CCGGCCGCGTCTGGTTCCAGAACAACTCGAGTTGTTCTGGAACCAGACGCGGTTTTTG,AATTCAAAAACCGCGTCTGGTTCCAGAACAACTCGAGTTGTTCTGGAACCAGACGCGG,n/a
mouse,14747,Cmklr1,XM_006530164.3,TRCN0000240652,XM_987021.1-563s21c1,TCTGGTTCCAGAACCGCCGAA,pLKO_005,944,CDS,85,89,,,Y,672284,Nkx1-1,CCGGTCTGGTTCCAGAACCGCCGAACTCGAGTTCGGCGGTTCTGGAACCAGATTTTTG,AATTCAAAAATCTGGTTCCAGAACCGCCGAACTCGAGTTCGGCGGTTCTGGAACCAGA,n/a
mouse,14747,Cmklr1,XM_006530164.3,TRCN0000005202,NM_003369.2-1919s1c1,CCTAGCCAAGAACAAGGAGAA,pLKO.1,1263,CDS,80,89,,,Y,7405,UVRAG,CCGGCCTAGCCAAGAACAAGGAGAACTCGAGTTCTCCTTGTTCTTGGCTAGGTTTTTG,AATTCAAAAACCTAGCCAAGAACAAGGAGAACTCGAGTTCTCCTTGTTCTTGGCTAGG,n/a
mouse,14747,Cmklr1,XM_006530164.3,TRCN0000235351,XM_984902.1-50s21c1,GTGAATGTGAGAAATGCTTTA,pLKO_005,136,5UTR,80,89,,,Y,666605,EG666605,CCGGGTGAATGTGAGAAATGCTTTACTCGAGTAAAGCATTTCTCACATTCACTTTTTG,AATTCAAAAAGTGAATGTGAGAAATGCTTTACTCGAGTAAAGCATTTCTCACATTCAC,n/a
mouse,14747,Cmklr1,XM_006530164.3,TRCN0000144215,NM_021208.1-371s1c1,CCTCATCATCATCTTCTTCAA,pLKO.1,1302,CDS,80,89,,,Y,58483,LINC00474,CCGGCCTCATCATCATCTTCTTCAACTCGAGTTGAAGAAGATGATGATGAGGTTTTTG,AATTCAAAAACCTCATCATCATCTTCTTCAACTCGAGTTGAAGAAGATGATGATGAGG,n/a
mouse,14747,Cmklr1,XM_006530164.3,TRCN0000006237,NM_004203.3-1436s1c1,GCTGCGTTCTGTCCTTGTCAT,pLKO.1,46,5UTR,80,89,,,Y,9088,PKMYT1,CCGGGCTGCGTTCTGTCCTTGTCATCTCGAGATGACAAGGACAGAACGCAGCTTTTTG,AATTCAAAAAGCTGCGTTCTGTCCTTGTCATCTCGAGATGACAAGGACAGAACGCAGC,n/a
mouse,14747,Cmklr1,XM_006530164.3,TRCN0000011276,NM_004072.1-1562s1c1,GCTTTACCAAGATGTCATCAA,pLKO.1,1565,CDS,80,89,,,Y,1240,CMKLR1,CCGGGCTTTACCAAGATGTCATCAACTCGAGTTGATGACATCTTGGTAAAGCTTTTTG,AATTCAAAAAGCTTTACCAAGATGTCATCAACTCGAGTTGATGACATCTTGGTAAAGC,n/a
mouse,14747,Cmklr1,XM_006530164.3,TRCN0000011277,NM_004072.1-969s1c1,CCTGGCTTACATGGCCTGCAT,pLKO.1,972,CDS,80,89,,,Y,1240,CMKLR1,CCGGCCTGGCTTACATGGCCTGCATCTCGAGATGCAGGCCATGTAAGCCAGGTTTTTG,AATTCAAAAACCTGGCTTACATGGCCTGCATCTCGAGATGCAGGCCATGTAAGCCAGG,n/a
mouse,14747,Cmklr1,XM_006530164.3,TRCN0000204828,XM_291980.3-208s1c1,GACCTCCTGTTCACATCTGTT,pLKO.1,763,CDS,86,85,,,Y,338755,OR2AG2,CCGGGACCTCCTGTTCACATCTGTTCTCGAGAACAGATGTGAACAGGAGGTCTTTTTG,AATTCAAAAAGACCTCCTGTTCACATCTGTTCTCGAGAACAGATGTGAACAGGAGGTC,n/a
mouse,14747,Cmklr1,XM_006530164.3,TRCN0000584603,,ACCACACTCTGTGCCAAGATG,pLKO_005,1364,CDS,81,85,,,Y,81442,OR6N2,CCGGACCACACTCTGTGCCAAGATGCTCGAGCATCTTGGCACAGAGTGTGGTTTTTTG,AATTCAAAAAACCACACTCTGTGCCAAGATGCTCGAGCATCTTGGCACAGAGTGTGGT,n/a
mouse,14747,Cmklr1,XM_006530164.3,TRCN0000064288,NM_000497.2-853s1c1,CCCTCAACAGTACACCAGCAT,pLKO.1,869,CDS,81,85,,,Y,1584,CYP11B1,CCGGCCCTCAACAGTACACCAGCATCTCGAGATGCTGGTGTACTGTTGAGGGTTTTTG,AATTCAAAAACCCTCAACAGTACACCAGCATCTCGAGATGCTGGTGTACTGTTGAGGG,n/a
mouse,14747,Cmklr1,XM_006530164.3,TRCN0000165969,NM_001013704.1-2836s1c1,GCAACTGAGAAACAGCCAGAT,pLKO.1,178,5UTR,81,85,,,Y,440313,LOC440313,CCGGGCAACTGAGAAACAGCCAGATCTCGAGATCTGGCTGTTTCTCAGTTGCTTTTTG,AATTCAAAAAGCAACTGAGAAACAGCCAGATCTCGAGATCTGGCTGTTTCTCAGTTGC,n/a
mouse,14747,Cmklr1,XM_006530164.3,TRCN0000044831,NM_015638.2-2206s1c1,CCTGCTCAACAACTTCCACAA,pLKO.1,1073,CDS,77,85,,,Y,26133,TRPC4AP,CCGGCCTGCTCAACAACTTCCACAACTCGAGTTGTGGAAGTTGTTGAGCAGGTTTTTG,AATTCAAAAACCTGCTCAACAACTTCCACAACTCGAGTTGTGGAAGTTGTTGAGCAGG,n/a
