Taxon,"Gene ID","Gene Symbol",Transcript,"Clone ID","Legacy Clone Name","Target Seq",Vector,"Match Position","Match Region","Match %","SDR Match %","Intrinsic Score","Adjusted Score","Matches Other Gene in Same Taxon?","Orig. Target Gene ID","Orig. Target Gene Symbol","Forward Oligo Sequence","Reverse Oligo Sequence",Addgene
human,203062,TSNARE1,XM_011516924.1,TRCN0000139680,NM_145003.1-222s1c1,CGAGTATGGAATCCGCCATTT,pLKO.1,147,CDS,100,100,10.8,15.12,N,203062,TSNARE1,CCGGCGAGTATGGAATCCGCCATTTCTCGAGAAATGGCGGATTCCATACTCGTTTTTG,AATTCAAAAACGAGTATGGAATCCGCCATTTCTCGAGAAATGGCGGATTCCATACTCG,n/a
human,203062,TSNARE1,XM_011516924.1,TRCN0000139991,NM_145003.1-208s1c1,GCTAGATGTTGGACCGAGTAT,pLKO.1,133,CDS,100,100,4.95,6.93,N,203062,TSNARE1,CCGGGCTAGATGTTGGACCGAGTATCTCGAGATACTCGGTCCAACATCTAGCTTTTTG,AATTCAAAAAGCTAGATGTTGGACCGAGTATCTCGAGATACTCGGTCCAACATCTAGC,n/a
human,203062,TSNARE1,XM_011516924.1,TRCN0000139628,NM_145003.1-911s1c1,CCAACGTCTTCCGAATCAACT,pLKO.1,836,CDS,100,100,4.95,3.96,N,203062,TSNARE1,CCGGCCAACGTCTTCCGAATCAACTCTCGAGAGTTGATTCGGAAGACGTTGGTTTTTG,AATTCAAAAACCAACGTCTTCCGAATCAACTCTCGAGAGTTGATTCGGAAGACGTTGG,n/a
human,203062,TSNARE1,XM_011516924.1,TRCN0000130962,NM_020814.1-2571s1c1,CCAAGACCTTCTCTTCCAGAT,pLKO.1,725,CDS,86,95,,,Y,57574,MARCHF4,CCGGCCAAGACCTTCTCTTCCAGATCTCGAGATCTGGAAGAGAAGGTCTTGGTTTTTG,AATTCAAAAACCAAGACCTTCTCTTCCAGATCTCGAGATCTGGAAGAGAAGGTCTTGG,n/a
human,203062,TSNARE1,XM_011516924.1,TRCN0000128355,NM_001005852.1-273s1c1,GCAGATATGTTGTGTAACTCT,pLKO.1,1545,3UTR,90,89,,,Y,246126,TXLNGY,CCGGGCAGATATGTTGTGTAACTCTCTCGAGAGAGTTACACAACATATCTGCTTTTTG,AATTCAAAAAGCAGATATGTTGTGTAACTCTCTCGAGAGAGTTACACAACATATCTGC,n/a
human,203062,TSNARE1,XM_011516924.1,TRCN0000252235,NM_001033235.2-1122s21c1,AGGAGGTGGCCAAGATCTTTA,pLKO_005,716,CDS,80,89,,,Y,195359,Trim40,CCGGAGGAGGTGGCCAAGATCTTTACTCGAGTAAAGATCTTGGCCACCTCCTTTTTTG,AATTCAAAAAAGGAGGTGGCCAAGATCTTTACTCGAGTAAAGATCTTGGCCACCTCCT,n/a
human,203062,TSNARE1,XM_011516924.1,TRCN0000254824,NM_001012708.2-573s21c1,TTCCCAGTCCAGCTGCTGTAA,pLKO_005,1611,3UTR,80,89,,,Y,387266,KRTAP5-3,CCGGTTCCCAGTCCAGCTGCTGTAACTCGAGTTACAGCAGCTGGACTGGGAATTTTTG,AATTCAAAAATTCCCAGTCCAGCTGCTGTAACTCGAGTTACAGCAGCTGGACTGGGAA,n/a
human,203062,TSNARE1,XM_011516924.1,TRCN0000419052,NM_016076.3-315s21c1,GAACGAATATACCTCATCCAT,pLKO_005,2090,3UTR,81,85,,,Y,51029,DESI2,CCGGGAACGAATATACCTCATCCATCTCGAGATGGATGAGGTATATTCGTTCTTTTTG,AATTCAAAAAGAACGAATATACCTCATCCATCTCGAGATGGATGAGGTATATTCGTTC,n/a
human,203062,TSNARE1,XM_011516924.1,TRCN0000007233,NM_003900.2-2678s1c1,GCCCTCCATTTGTAAGAACAA,pLKO.1,20,5UTR,81,85,,,Y,8878,SQSTM1,CCGGGCCCTCCATTTGTAAGAACAACTCGAGTTGTTCTTACAAATGGAGGGCTTTTTG,AATTCAAAAAGCCCTCCATTTGTAAGAACAACTCGAGTTGTTCTTACAAATGGAGGGC,n/a
