Taxon,"Gene ID","Gene Symbol",Transcript,"Clone ID","Legacy Clone Name","Target Seq",Vector,"Match Position","Match Region","Match %","SDR Match %","Intrinsic Score","Adjusted Score","Matches Other Gene in Same Taxon?","Orig. Target Gene ID","Orig. Target Gene Symbol","Forward Oligo Sequence","Reverse Oligo Sequence",Addgene
human,26150,RIBC2,XM_011530126.2,TRCN0000243071,NM_015653.2-1057s21c1,CCTAGTCCAGAAGCAGCAAAT,pLKO_005,594,CDS,100,100,10.8,7.56,N,26150,RIBC2,CCGGCCTAGTCCAGAAGCAGCAAATCTCGAGATTTGCTGCTTCTGGACTAGGTTTTTG,AATTCAAAAACCTAGTCCAGAAGCAGCAAATCTCGAGATTTGCTGCTTCTGGACTAGG,n/a
human,26150,RIBC2,XM_011530126.2,TRCN0000174627,NM_026333.2-155s1c1,GTACATCTGTGAAAGACTTTA,pLKO.1,368,CDS,90,95,,,N,67715,2010106E10Rik,CCGGGTACATCTGTGAAAGACTTTACTCGAGTAAAGTCTTTCACAGATGTACTTTTTG,AATTCAAAAAGTACATCTGTGAAAGACTTTACTCGAGTAAAGTCTTTCACAGATGTAC,n/a
human,26150,RIBC2,XM_011530126.2,TRCN0000234395,NM_022491.2-948s21c1,ACAAGAGCCAGGCCATCTATC,pLKO_005,389,CDS,85,95,,,Y,64426,SUDS3,CCGGACAAGAGCCAGGCCATCTATCCTCGAGGATAGATGGCCTGGCTCTTGTTTTTTG,AATTCAAAAAACAAGAGCCAGGCCATCTATCCTCGAGGATAGATGGCCTGGCTCTTGT,n/a
human,26150,RIBC2,XM_011530126.2,TRCN0000168534,NM_025261.1-279s1c1,CTTCAACCAAACCAACCGTAA,pLKO.1,21,5UTR,85,89,,,Y,80740,LY6G6C,CCGGCTTCAACCAAACCAACCGTAACTCGAGTTACGGTTGGTTTGGTTGAAGTTTTTG,AATTCAAAAACTTCAACCAAACCAACCGTAACTCGAGTTACGGTTGGTTTGGTTGAAG,n/a
human,26150,RIBC2,XM_011530126.2,TRCN0000019637,NM_153812.1-453s1c1,CCGTGGAAGACTTCAACAAAT,pLKO.1,374,CDS,80,89,,,Y,148479,PHF13,CCGGCCGTGGAAGACTTCAACAAATCTCGAGATTTGTTGAAGTCTTCCACGGTTTTTG,AATTCAAAAACCGTGGAAGACTTCAACAAATCTCGAGATTTGTTGAAGTCTTCCACGG,n/a
human,26150,RIBC2,XM_011530126.2,TRCN0000156360,NM_138791.1-355s1c1,CTCCAGAAGCTGGGAATCAAA,pLKO.1,331,CDS,80,89,,,Y,122945,NOXRED1,CCGGCTCCAGAAGCTGGGAATCAAACTCGAGTTTGATTCCCAGCTTCTGGAGTTTTTG,AATTCAAAAACTCCAGAAGCTGGGAATCAAACTCGAGTTTGATTCCCAGCTTCTGGAG,n/a
human,26150,RIBC2,XM_011530126.2,TRCN0000163712,NM_025248.1-2778s1c1,GACTGACTTCAACAAGAGCGT,pLKO.1,378,CDS,80,89,,,Y,80725,SRCIN1,CCGGGACTGACTTCAACAAGAGCGTCTCGAGACGCTCTTGTTGAAGTCAGTCTTTTTG,AATTCAAAAAGACTGACTTCAACAAGAGCGTCTCGAGACGCTCTTGTTGAAGTCAGTC,n/a
human,26150,RIBC2,XM_011530126.2,TRCN0000381568,NM_019656.3-534s21c1,CAACTCCACAGGAGACTATAG,pLKO_005,826,CDS,80,89,,,Y,56496,Tspan6,CCGGCAACTCCACAGGAGACTATAGCTCGAGCTATAGTCTCCTGTGGAGTTGTTTTTG,AATTCAAAAACAACTCCACAGGAGACTATAGCTCGAGCTATAGTCTCCTGTGGAGTTG,n/a
human,26150,RIBC2,XM_011530126.2,TRCN0000121913,NM_022071.2-1453s1c1,CGAGTCAGTGAAAGGATCAAA,pLKO.1,405,CDS,81,85,,,Y,63898,SH2D4A,CCGGCGAGTCAGTGAAAGGATCAAACTCGAGTTTGATCCTTTCACTGACTCGTTTTTG,AATTCAAAAACGAGTCAGTGAAAGGATCAAACTCGAGTTTGATCCTTTCACTGACTCG,n/a
human,26150,RIBC2,XM_011530126.2,TRCN0000222866,turboGfp-531s1c1,GGACAGCCACATGCACTTCAA,pLKO.1,139,5UTR,77,85,,,Y,tGFP,tGFP,CCGGGGACAGCCACATGCACTTCAACTCGAGTTGAAGTGCATGTGGCTGTCCTTTTTG,AATTCAAAAAGGACAGCCACATGCACTTCAACTCGAGTTGAAGTGCATGTGGCTGTCC,n/a
