Taxon,"Gene ID","Gene Symbol",Transcript,"Clone ID","Legacy Clone Name","Target Seq",Vector,"Match Position","Match Region","Match %","SDR Match %","Intrinsic Score","Adjusted Score","Matches Other Gene in Same Taxon?","Orig. Target Gene ID","Orig. Target Gene Symbol","Forward Oligo Sequence","Reverse Oligo Sequence",Addgene
human,7404,UTY,XM_011531463.3,TRCN0000229955,NM_007125.3-2862s21c1,GGCAACTAGCACTGGTATTAA,pLKO_005,2395,CDS,100,100,15,21,N,7404,UTY,CCGGGGCAACTAGCACTGGTATTAACTCGAGTTAATACCAGTGCTAGTTGCCTTTTTG,AATTCAAAAAGGCAACTAGCACTGGTATTAACTCGAGTTAATACCAGTGCTAGTTGCC,n/a
human,7404,UTY,XM_011531463.3,TRCN0000108116,NM_007125.3-2298s1c1,GCGAGCAAATAGAGATAATTT,pLKO.1,1783,CDS,100,100,15,12,N,7404,UTY,CCGGGCGAGCAAATAGAGATAATTTCTCGAGAAATTATCTCTATTTGCTCGCTTTTTG,AATTCAAAAAGCGAGCAAATAGAGATAATTTCTCGAGAAATTATCTCTATTTGCTCGC,n/a
human,7404,UTY,XM_011531463.3,TRCN0000108117,NM_007125.3-2633s1c1,GCAGTAATTGTATAGCAGGAA,pLKO.1,2118,CDS,100,100,2.64,1.848,N,7404,UTY,CCGGGCAGTAATTGTATAGCAGGAACTCGAGTTCCTGCTATACAATTACTGCTTTTTG,AATTCAAAAAGCAGTAATTGTATAGCAGGAACTCGAGTTCCTGCTATACAATTACTGC,n/a
human,7404,UTY,XM_011531463.3,TRCN0000218022,NM_007125.3-2001s21c1,GGATGCTTTACAGGCATATAT,pLKO_005,1351,CDS,100,100,15,9,N,7404,UTY,CCGGGGATGCTTTACAGGCATATATCTCGAGATATATGCCTGTAAAGCATCCTTTTTG,AATTCAAAAAGGATGCTTTACAGGCATATATCTCGAGATATATGCCTGTAAAGCATCC,n/a
human,7404,UTY,XM_011531463.3,TRCN0000229956,NM_007125.3-3657s21c1,TCCACCCACACCTAGTATTTA,pLKO_005,3190,CDS,100,100,15,9,N,7404,UTY,CCGGTCCACCCACACCTAGTATTTACTCGAGTAAATACTAGGTGTGGGTGGATTTTTG,AATTCAAAAATCCACCCACACCTAGTATTTACTCGAGTAAATACTAGGTGTGGGTGGA,n/a
human,7404,UTY,XM_011531463.3,TRCN0000165534,NM_001012717.1-362s1c1,GAGACAGGGTTTCACCATGTT,pLKO.1,3662,CDS,100,100,4.95,2.475,Y,,,CCGGGAGACAGGGTTTCACCATGTTCTCGAGAACATGGTGAAACCCTGTCTCTTTTTG,AATTCAAAAAGAGACAGGGTTTCACCATGTTCTCGAGAACATGGTGAAACCCTGTCTC,n/a
human,7404,UTY,XM_011531463.3,TRCN0000155836,NM_198582.1-3275s1c1,CCCAAAGTGCTGGGATTACAA,pLKO.1,3735,CDS,95,100,5.625,2.8125,Y,377007,KLHL30,CCGGCCCAAAGTGCTGGGATTACAACTCGAGTTGTAATCCCAGCACTTTGGGTTTTTG,AATTCAAAAACCCAAAGTGCTGGGATTACAACTCGAGTTGTAATCCCAGCACTTTGGG,n/a
human,7404,UTY,XM_011531463.3,TRCN0000141025,NM_152361.1-835s1c1,CCCAAAGTGCTGGGATTACTT,pLKO.1,3735,CDS,90,100,5.625,2.8125,Y,126272,EID2B,CCGGCCCAAAGTGCTGGGATTACTTCTCGAGAAGTAATCCCAGCACTTTGGGTTTTTG,AATTCAAAAACCCAAAGTGCTGGGATTACTTCTCGAGAAGTAATCCCAGCACTTTGGG,n/a
human,7404,UTY,XM_011531463.3,TRCN0000096242,NM_009483.1-581s1c1,GCTACGAATCTCTAATCTTAA,pLKO.1,582,CDS,95,95,,,Y,22289,Kdm6a,CCGGGCTACGAATCTCTAATCTTAACTCGAGTTAAGATTAGAGATTCGTAGCTTTTTG,AATTCAAAAAGCTACGAATCTCTAATCTTAACTCGAGTTAAGATTAGAGATTCGTAGC,n/a
human,7404,UTY,XM_011531463.3,TRCN0000331919,NM_009483.1-581s21c1,GCTACGAATCTCTAATCTTAA,pLKO_005,582,CDS,95,95,,,Y,22289,Kdm6a,CCGGGCTACGAATCTCTAATCTTAACTCGAGTTAAGATTAGAGATTCGTAGCTTTTTG,AATTCAAAAAGCTACGAATCTCTAATCTTAACTCGAGTTAAGATTAGAGATTCGTAGC,n/a
human,7404,UTY,XM_011531463.3,TRCN0000162985,NM_207497.1-342s1c1,GAGACAAGGTTTCACCATGTT,pLKO.1,3662,CDS,95,95,,,Y,401253,LINC00336,CCGGGAGACAAGGTTTCACCATGTTCTCGAGAACATGGTGAAACCTTGTCTCTTTTTG,AATTCAAAAAGAGACAAGGTTTCACCATGTTCTCGAGAACATGGTGAAACCTTGTCTC,n/a
human,7404,UTY,XM_011531463.3,TRCN0000095070,NM_009484.1-809s1c1,GCACCATAATATGGATCTAAT,pLKO.1,1102,CDS,90,95,,,N,22290,Uty,CCGGGCACCATAATATGGATCTAATCTCGAGATTAGATCCATATTATGGTGCTTTTTG,AATTCAAAAAGCACCATAATATGGATCTAATCTCGAGATTAGATCCATATTATGGTGC,n/a
human,7404,UTY,XM_011531463.3,TRCN0000095071,NM_009484.1-1113s1c1,GCCTGGATGGACTTAGGTATT,pLKO.1,1406,CDS,90,95,,,N,22290,Uty,CCGGGCCTGGATGGACTTAGGTATTCTCGAGAATACCTAAGTCCATCCAGGCTTTTTG,AATTCAAAAAGCCTGGATGGACTTAGGTATTCTCGAGAATACCTAAGTCCATCCAGGC,n/a
human,7404,UTY,XM_011531463.3,TRCN0000095073,NM_009484.1-808s1c1,TGCACCATAATATGGATCTAA,pLKO.1,1101,CDS,90,95,,,N,22290,Uty,CCGGTGCACCATAATATGGATCTAACTCGAGTTAGATCCATATTATGGTGCATTTTTG,AATTCAAAAATGCACCATAATATGGATCTAACTCGAGTTAGATCCATATTATGGTGCA,n/a
human,7404,UTY,XM_011531463.3,TRCN0000096243,NM_009483.1-2821s1c1,CCTTCTCCTAAGTCCACTGAA,pLKO.1,2861,CDS,90,95,,,N,22289,Kdm6a,CCGGCCTTCTCCTAAGTCCACTGAACTCGAGTTCAGTGGACTTAGGAGAAGGTTTTTG,AATTCAAAAACCTTCTCCTAAGTCCACTGAACTCGAGTTCAGTGGACTTAGGAGAAGG,n/a
human,7404,UTY,XM_011531463.3,TRCN0000165027,NM_001013636.1-513s1c1,GAACTCCTGACCTCAAGTGAT,pLKO.1,3698,CDS,90,95,,,Y,387873,LOC387873,CCGGGAACTCCTGACCTCAAGTGATCTCGAGATCACTTGAGGTCAGGAGTTCTTTTTG,AATTCAAAAAGAACTCCTGACCTCAAGTGATCTCGAGATCACTTGAGGTCAGGAGTTC,n/a
human,7404,UTY,XM_011531463.3,TRCN0000148469,NM_152459.2-1181s1c1,CTGGGTTCAAGCAATTCTCTT,pLKO.1,3570,CDS,85,95,,,Y,146556,C16orf89,CCGGCTGGGTTCAAGCAATTCTCTTCTCGAGAAGAGAATTGCTTGAACCCAGTTTTTG,AATTCAAAAACTGGGTTCAAGCAATTCTCTTCTCGAGAAGAGAATTGCTTGAACCCAG,n/a
human,7404,UTY,XM_011531463.3,TRCN0000242894,NM_152499.1-235s21c1,CGCGAAGTGAAGAGGATTCTG,pLKO_005,440,CDS,90,90,,,Y,149473,CCDC24,CCGGCGCGAAGTGAAGAGGATTCTGCTCGAGCAGAATCCTCTTCACTTCGCGTTTTTG,AATTCAAAAACGCGAAGTGAAGAGGATTCTGCTCGAGCAGAATCCTCTTCACTTCGCG,n/a
human,7404,UTY,XM_011531463.3,TRCN0000162624,NM_020317.3-978s1c1,CCAGCAAAGAAGCATAGCTTT,pLKO.1,1808,CDS,81,90,,,Y,57035,RSRP1,CCGGCCAGCAAAGAAGCATAGCTTTCTCGAGAAAGCTATGCTTCTTTGCTGGTTTTTG,AATTCAAAAACCAGCAAAGAAGCATAGCTTTCTCGAGAAAGCTATGCTTCTTTGCTGG,n/a
human,7404,UTY,XM_011531463.3,TRCN0000305301,NM_009483.1-778s21c1,GCATTTCAGTGGGCTATTAAA,pLKO_005,779,CDS,90,89,,,Y,22289,Kdm6a,CCGGGCATTTCAGTGGGCTATTAAACTCGAGTTTAATAGCCCACTGAAATGCTTTTTG,AATTCAAAAAGCATTTCAGTGGGCTATTAAACTCGAGTTTAATAGCCCACTGAAATGC,n/a
human,7404,UTY,XM_011531463.3,TRCN0000148148,NM_152654.1-1281s1c1,GAGACAGAGTTTCACCATATT,pLKO.1,3662,CDS,90,89,,,Y,199699,DAND5,CCGGGAGACAGAGTTTCACCATATTCTCGAGAATATGGTGAAACTCTGTCTCTTTTTG,AATTCAAAAAGAGACAGAGTTTCACCATATTCTCGAGAATATGGTGAAACTCTGTCTC,n/a
human,7404,UTY,XM_011531463.3,TRCN0000078633,NM_032214.2-1896s1c1,CCTCCAGAATAGCTGGGATTA,pLKO.1,3598,CDS,90,89,,,Y,84174,SLA2,CCGGCCTCCAGAATAGCTGGGATTACTCGAGTAATCCCAGCTATTCTGGAGGTTTTTG,AATTCAAAAACCTCCAGAATAGCTGGGATTACTCGAGTAATCCCAGCTATTCTGGAGG,n/a
human,7404,UTY,XM_011531463.3,TRCN0000075284,NM_031213.2-887s1c1,CCACTGCAACATCTTCTCCTA,pLKO.1,2850,CDS,90,89,,,Y,81926,ABHD17A,CCGGCCACTGCAACATCTTCTCCTACTCGAGTAGGAGAAGATGTTGCAGTGGTTTTTG,AATTCAAAAACCACTGCAACATCTTCTCCTACTCGAGTAGGAGAAGATGTTGCAGTGG,n/a
human,7404,UTY,XM_011531463.3,TRCN0000204533,NM_001013675.1-1987s1c1,CCTCCCAAAGTGCTGGAATTA,pLKO.1,3732,CDS,90,89,,,Y,400891,LRRC74B,CCGGCCTCCCAAAGTGCTGGAATTACTCGAGTAATTCCAGCACTTTGGGAGGTTTTTG,AATTCAAAAACCTCCCAAAGTGCTGGAATTACTCGAGTAATTCCAGCACTTTGGGAGG,n/a
human,7404,UTY,XM_011531463.3,TRCN0000116737,NM_016369.3-2405s1c1,CCTCCCAAGTAGCTGGAATTA,pLKO.1,3598,CDS,90,89,,,Y,51208,CLDN18,CCGGCCTCCCAAGTAGCTGGAATTACTCGAGTAATTCCAGCTACTTGGGAGGTTTTTG,AATTCAAAAACCTCCCAAGTAGCTGGAATTACTCGAGTAATTCCAGCTACTTGGGAGG,n/a
human,7404,UTY,XM_011531463.3,TRCN0000063698,NM_006989.3-4525s1c1,GCCCAGCTAATTCTTGTATTT,pLKO.1,3636,CDS,90,89,,,Y,10156,RASA4,CCGGGCCCAGCTAATTCTTGTATTTCTCGAGAAATACAAGAATTAGCTGGGCTTTTTG,AATTCAAAAAGCCCAGCTAATTCTTGTATTTCTCGAGAAATACAAGAATTAGCTGGGC,n/a
human,7404,UTY,XM_011531463.3,TRCN0000150276,NM_144718.2-3773s1c1,GCCCAGCTAATTTGTGTATTT,pLKO.1,3636,CDS,90,89,,,Y,152185,SPICE1,CCGGGCCCAGCTAATTTGTGTATTTCTCGAGAAATACACAAATTAGCTGGGCTTTTTG,AATTCAAAAAGCCCAGCTAATTTGTGTATTTCTCGAGAAATACACAAATTAGCTGGGC,n/a
human,7404,UTY,XM_011531463.3,TRCN0000072628,NM_016065.3-1636s1c1,CCTCCCAAAGTGCTAGGATTA,pLKO.1,3732,CDS,90,89,,,Y,51021,MRPS16,CCGGCCTCCCAAAGTGCTAGGATTACTCGAGTAATCCTAGCACTTTGGGAGGTTTTTG,AATTCAAAAACCTCCCAAAGTGCTAGGATTACTCGAGTAATCCTAGCACTTTGGGAGG,n/a
human,7404,UTY,XM_011531463.3,TRCN0000139826,NM_133477.1-4628s1c1,CCTCCTGAATAGCTGGGATTA,pLKO.1,3598,CDS,90,89,,,Y,171024,SYNPO2,CCGGCCTCCTGAATAGCTGGGATTACTCGAGTAATCCCAGCTATTCAGGAGGTTTTTG,AATTCAAAAACCTCCTGAATAGCTGGGATTACTCGAGTAATCCCAGCTATTCAGGAGG,n/a
human,7404,UTY,XM_011531463.3,TRCN0000165436,NM_001012391.1-1011s1c1,GAGAAAGGGTTTCGCCATGTT,pLKO.1,3662,CDS,90,89,,,Y,100652781,SNX29P1,CCGGGAGAAAGGGTTTCGCCATGTTCTCGAGAACATGGCGAAACCCTTTCTCTTTTTG,AATTCAAAAAGAGAAAGGGTTTCGCCATGTTCTCGAGAACATGGCGAAACCCTTTCTC,n/a
human,7404,UTY,XM_011531463.3,TRCN0000165026,NM_001012391.1-1008s1c1,GTAGAGAAAGGGTTTCGCCAT,pLKO.1,3659,CDS,90,89,,,Y,100652781,SNX29P1,CCGGGTAGAGAAAGGGTTTCGCCATCTCGAGATGGCGAAACCCTTTCTCTACTTTTTG,AATTCAAAAAGTAGAGAAAGGGTTTCGCCATCTCGAGATGGCGAAACCCTTTCTCTAC,n/a
human,7404,UTY,XM_011531463.3,TRCN0000164801,NM_016534.2-1646s1c1,CCTCCCAAAGTACTGGGATTA,pLKO.1,3732,CDS,90,89,,,Y,51275,MAPKAPK5-AS1,CCGGCCTCCCAAAGTACTGGGATTACTCGAGTAATCCCAGTACTTTGGGAGGTTTTTG,AATTCAAAAACCTCCCAAAGTACTGGGATTACTCGAGTAATCCCAGTACTTTGGGAGG,n/a
human,7404,UTY,XM_011531463.3,TRCN0000008902,NM_016540.2-2291s1c1,CCTCCCAAAGTGTTGGGATTA,pLKO.1,3732,CDS,90,89,,,Y,10888,GPR83,CCGGCCTCCCAAAGTGTTGGGATTACTCGAGTAATCCCAACACTTTGGGAGGTTTTTG,AATTCAAAAACCTCCCAAAGTGTTGGGATTACTCGAGTAATCCCAACACTTTGGGAGG,n/a
human,7404,UTY,XM_011531463.3,TRCN0000156315,NM_020702.1-3633s1c1,CCTCCCAAAGTGTTGGGATTA,pLKO.1,3732,CDS,90,89,,,Y,57462,MYORG,CCGGCCTCCCAAAGTGTTGGGATTACTCGAGTAATCCCAACACTTTGGGAGGTTTTTG,AATTCAAAAACCTCCCAAAGTGTTGGGATTACTCGAGTAATCCCAACACTTTGGGAGG,n/a
human,7404,UTY,XM_011531463.3,TRCN0000116227,NM_024930.1-2895s1c1,CCTCCCAAAGTTCTGGGATTA,pLKO.1,3732,CDS,90,89,,,Y,79993,ELOVL7,CCGGCCTCCCAAAGTTCTGGGATTACTCGAGTAATCCCAGAACTTTGGGAGGTTTTTG,AATTCAAAAACCTCCCAAAGTTCTGGGATTACTCGAGTAATCCCAGAACTTTGGGAGG,n/a
human,7404,UTY,XM_011531463.3,TRCN0000164591,NM_003281.3-2102s1c1,CCTCCCAAAGTTCTGGGATTA,pLKO.1,3732,CDS,90,89,,,Y,7135,TNNI1,CCGGCCTCCCAAAGTTCTGGGATTACTCGAGTAATCCCAGAACTTTGGGAGGTTTTTG,AATTCAAAAACCTCCCAAAGTTCTGGGATTACTCGAGTAATCCCAGAACTTTGGGAGG,n/a
human,7404,UTY,XM_011531463.3,TRCN0000040213,NM_000618.2-6169s1c1,CCTCCCAAATTGCTGGGATTA,pLKO.1,3732,CDS,90,89,,,Y,3479,IGF1,CCGGCCTCCCAAATTGCTGGGATTACTCGAGTAATCCCAGCAATTTGGGAGGTTTTTG,AATTCAAAAACCTCCCAAATTGCTGGGATTACTCGAGTAATCCCAGCAATTTGGGAGG,n/a
human,7404,UTY,XM_011531463.3,TRCN0000140374,NM_025042.2-1098s1c1,GCTTCCCAAAGTACTGGGATT,pLKO.1,3731,CDS,90,89,,,Y,,,CCGGGCTTCCCAAAGTACTGGGATTCTCGAGAATCCCAGTACTTTGGGAAGCTTTTTG,AATTCAAAAAGCTTCCCAAAGTACTGGGATTCTCGAGAATCCCAGTACTTTGGGAAGC,n/a
human,7404,UTY,XM_011531463.3,TRCN0000296309,NM_000950.2-1244s21c1,CCATTAACTTCTACCTAAATC,pLKO_005,1458,CDS,85,89,,,Y,5638,PRRG1,CCGGCCATTAACTTCTACCTAAATCCTCGAGGATTTAGGTAGAAGTTAATGGTTTTTG,AATTCAAAAACCATTAACTTCTACCTAAATCCTCGAGGATTTAGGTAGAAGTTAATGG,n/a
human,7404,UTY,XM_011531463.3,TRCN0000003487,NM_000063.x-2208s1c1,GCCACGAGACTTTCACATCAA,pLKO.1,1701,CDS,85,89,,,Y,717,C2,CCGGGCCACGAGACTTTCACATCAACTCGAGTTGATGTGAAAGTCTCGTGGCTTTTTG,AATTCAAAAAGCCACGAGACTTTCACATCAACTCGAGTTGATGTGAAAGTCTCGTGGC,n/a
human,7404,UTY,XM_011531463.3,TRCN0000036894,NM_016541.1-233s1c1,ACCTGATGAAGAACAACCCAT,pLKO.1,2344,CDS,85,89,,,Y,51764,GNG13,CCGGACCTGATGAAGAACAACCCATCTCGAGATGGGTTGTTCTTCATCAGGTTTTTTG,AATTCAAAAAACCTGATGAAGAACAACCCATCTCGAGATGGGTTGTTCTTCATCAGGT,n/a
human,7404,UTY,XM_011531463.3,TRCN0000308263,NM_001834.2-385s21c1,CACAGTCAATGGAGATGTGTT,pLKO_005,2935,CDS,85,89,,,Y,1212,CLTB,CCGGCACAGTCAATGGAGATGTGTTCTCGAGAACACATCTCCATTGACTGTGTTTTTG,AATTCAAAAACACAGTCAATGGAGATGTGTTCTCGAGAACACATCTCCATTGACTGTG,n/a
human,7404,UTY,XM_011531463.3,TRCN0000162795,NM_017842.1-1079s1c1,CTTCCAAAGTGCTGGGATTAT,pLKO.1,3733,CDS,85,89,,,Y,55652,SLC48A1,CCGGCTTCCAAAGTGCTGGGATTATCTCGAGATAATCCCAGCACTTTGGAAGTTTTTG,AATTCAAAAACTTCCAAAGTGCTGGGATTATCTCGAGATAATCCCAGCACTTTGGAAG,n/a
human,7404,UTY,XM_011531463.3,TRCN0000337418,NM_001114403.1-1038s21c1,CCTCACGGGTTCAAGCGATTT,pLKO_005,3566,CDS,85,89,,,Y,100134938,UPK3BL1,CCGGCCTCACGGGTTCAAGCGATTTCTCGAGAAATCGCTTGAACCCGTGAGGTTTTTG,AATTCAAAAACCTCACGGGTTCAAGCGATTTCTCGAGAAATCGCTTGAACCCGTGAGG,n/a
human,7404,UTY,XM_011531463.3,TRCN0000140657,NM_012099.1-2957s1c1,CCTCCCAAAGTGCTAGGATAA,pLKO.1,3732,CDS,85,89,,,Y,10849,CD3EAP,CCGGCCTCCCAAAGTGCTAGGATAACTCGAGTTATCCTAGCACTTTGGGAGGTTTTTG,AATTCAAAAACCTCCCAAAGTGCTAGGATAACTCGAGTTATCCTAGCACTTTGGGAGG,n/a
human,7404,UTY,XM_011531463.3,TRCN0000110899,NM_011166.1-355s1c1,GCCGGGTGTATTCCTTGTGAA,pLKO.1,2057,CDS,80,89,,,N,19111,Prl6a1,CCGGGCCGGGTGTATTCCTTGTGAACTCGAGTTCACAAGGAATACACCCGGCTTTTTG,AATTCAAAAAGCCGGGTGTATTCCTTGTGAACTCGAGTTCACAAGGAATACACCCGGC,n/a
human,7404,UTY,XM_011531463.3,TRCN0000235568,NM_022767.3-195s21c1,CTTCCCTCACCATCCCAAATG,pLKO_005,3722,CDS,80,89,,,Y,64782,AEN,CCGGCTTCCCTCACCATCCCAAATGCTCGAGCATTTGGGATGGTGAGGGAAGTTTTTG,AATTCAAAAACTTCCCTCACCATCCCAAATGCTCGAGCATTTGGGATGGTGAGGGAAG,n/a
human,7404,UTY,XM_011531463.3,TRCN0000218066,XM_001006405.1-986s21c1,ATGGTCTACTTCAACTACATG,pLKO_005,758,CDS,80,89,,,Y,545793,AB010352,CCGGATGGTCTACTTCAACTACATGCTCGAGCATGTAGTTGAAGTAGACCATTTTTTG,AATTCAAAAAATGGTCTACTTCAACTACATGCTCGAGCATGTAGTTGAAGTAGACCAT,n/a
human,7404,UTY,XM_011531463.3,TRCN0000142424,NM_015077.1-1770s1c1,GCAACTTTGTGTTGGTGCTAT,pLKO.1,69,5UTR,80,89,,,Y,23098,SARM1,CCGGGCAACTTTGTGTTGGTGCTATCTCGAGATAGCACCAACACAAAGTTGCTTTTTG,AATTCAAAAAGCAACTTTGTGTTGGTGCTATCTCGAGATAGCACCAACACAAAGTTGC,n/a
human,7404,UTY,XM_011531463.3,TRCN0000018127,NM_015035.2-1943s1c1,GCGAAGTTGAACATCTCACAA,pLKO.1,2420,CDS,80,89,,,Y,23051,ZHX3,CCGGGCGAAGTTGAACATCTCACAACTCGAGTTGTGAGATGTTCAACTTCGCTTTTTG,AATTCAAAAAGCGAAGTTGAACATCTCACAACTCGAGTTGTGAGATGTTCAACTTCGC,n/a
human,7404,UTY,XM_011531463.3,TRCN0000353580,NM_015035.3-1943s21c1,GCGAAGTTGAACATCTCACAA,pLKO_005,2420,CDS,80,89,,,Y,23051,ZHX3,CCGGGCGAAGTTGAACATCTCACAACTCGAGTTGTGAGATGTTCAACTTCGCTTTTTG,AATTCAAAAAGCGAAGTTGAACATCTCACAACTCGAGTTGTGAGATGTTCAACTTCGC,n/a
human,7404,UTY,XM_011531463.3,TRCN0000158930,NM_003007.2-1330s1c1,GTAATTATAGAGCAGGAAGAT,pLKO.1,2121,CDS,80,89,,,Y,6406,SEMG1,CCGGGTAATTATAGAGCAGGAAGATCTCGAGATCTTCCTGCTCTATAATTACTTTTTG,AATTCAAAAAGTAATTATAGAGCAGGAAGATCTCGAGATCTTCCTGCTCTATAATTAC,n/a
human,7404,UTY,XM_011531463.3,TRCN0000161599,NM_207385.1-227s1c1,GCTGAGACACAAAGAAGTTAA,pLKO.1,1864,CDS,80,89,,,Y,,,CCGGGCTGAGACACAAAGAAGTTAACTCGAGTTAACTTCTTTGTGTCTCAGCTTTTTG,AATTCAAAAAGCTGAGACACAAAGAAGTTAACTCGAGTTAACTTCTTTGTGTCTCAGC,n/a
human,7404,UTY,XM_011531463.3,TRCN0000001680,NM_009915.x-684s1c1,CCTCTCTACCAGGAATCATAT,pLKO.1,3501,CDS,80,89,,,Y,12772,Ccr2,CCGGCCTCTCTACCAGGAATCATATCTCGAGATATGATTCCTGGTAGAGAGGTTTTTG,AATTCAAAAACCTCTCTACCAGGAATCATATCTCGAGATATGATTCCTGGTAGAGAGG,n/a
human,7404,UTY,XM_011531463.3,TRCN0000313278,NM_133710.3-411s21c1,CAGCGCAACATCAGCCTAAAG,pLKO_005,1331,CDS,81,85,,,N,69274,Ctdspl,CCGGCAGCGCAACATCAGCCTAAAGCTCGAGCTTTAGGCTGATGTTGCGCTGTTTTTG,AATTCAAAAACAGCGCAACATCAGCCTAAAGCTCGAGCTTTAGGCTGATGTTGCGCTG,n/a
human,7404,UTY,XM_011531463.3,TRCN0000245860,NM_001080441.1-132s21c1,TCAAGCACAGCTGGAACAGTC,pLKO_005,1815,CDS,81,85,,,Y,143941,TTC36,CCGGTCAAGCACAGCTGGAACAGTCCTCGAGGACTGTTCCAGCTGTGCTTGATTTTTG,AATTCAAAAATCAAGCACAGCTGGAACAGTCCTCGAGGACTGTTCCAGCTGTGCTTGA,n/a
human,7404,UTY,XM_011531463.3,TRCN0000125468,NM_133710.1-492s1c1,CCAGCGCAACATCAGCCTAAA,pLKO.1,1330,CDS,77,85,,,Y,69274,Ctdspl,CCGGCCAGCGCAACATCAGCCTAAACTCGAGTTTAGGCTGATGTTGCGCTGGTTTTTG,AATTCAAAAACCAGCGCAACATCAGCCTAAACTCGAGTTTAGGCTGATGTTGCGCTGG,n/a
