Taxon,"Gene ID","Gene Symbol",Transcript,"Clone ID","Legacy Clone Name","Target Seq",Vector,"Match Position","Match Region","Match %","SDR Match %","Intrinsic Score","Adjusted Score","Matches Other Gene in Same Taxon?","Orig. Target Gene ID","Orig. Target Gene Symbol","Forward Oligo Sequence","Reverse Oligo Sequence",Addgene
human,54868,TMEM104,XM_017024798.2,TRCN0000122710,NM_017728.2-498s1c1,CCGGGTGGAAATGGGACAAAT,pLKO.1,528,CDS,100,100,13.2,9.24,N,54868,TMEM104,CCGGCCGGGTGGAAATGGGACAAATCTCGAGATTTGTCCCATTTCCACCCGGTTTTTG,AATTCAAAAACCGGGTGGAAATGGGACAAATCTCGAGATTTGTCCCATTTCCACCCGG,n/a
human,54868,TMEM104,XM_017024798.2,TRCN0000121699,NM_017728.2-552s1c1,CTTGTTCTATTTCTGCATCAT,pLKO.1,582,CDS,100,100,4.95,3.465,N,54868,TMEM104,CCGGCTTGTTCTATTTCTGCATCATCTCGAGATGATGCAGAAATAGAACAAGTTTTTG,AATTCAAAAACTTGTTCTATTTCTGCATCATCTCGAGATGATGCAGAAATAGAACAAG,n/a
human,54868,TMEM104,XM_017024798.2,TRCN0000252380,NM_001033393.1-189s21c1,TCGGGCTGGTGTACATGTTTA,pLKO_005,191,CDS,95,95,,,N,320534,Tmem104,CCGGTCGGGCTGGTGTACATGTTTACTCGAGTAAACATGTACACCAGCCCGATTTTTG,AATTCAAAAATCGGGCTGGTGTACATGTTTACTCGAGTAAACATGTACACCAGCCCGA,n/a
human,54868,TMEM104,XM_017024798.2,TRCN0000342782,NM_175857.3-59s21c1,TGTCTTCCCAGGATGCTACTG,pLKO_005,808,CDS,90,90,,,Y,337879,KRTAP8-1,CCGGTGTCTTCCCAGGATGCTACTGCTCGAGCAGTAGCATCCTGGGAAGACATTTTTG,AATTCAAAAATGTCTTCCCAGGATGCTACTGCTCGAGCAGTAGCATCCTGGGAAGACA,n/a
human,54868,TMEM104,XM_017024798.2,TRCN0000034467,NM_024458.1-668s1c1,CCTACGTTGCTGGTGTACAAA,pLKO.1,185,CDS,82,90,,,N,20028,Pdc,CCGGCCTACGTTGCTGGTGTACAAACTCGAGTTTGTACACCAGCAACGTAGGTTTTTG,AATTCAAAAACCTACGTTGCTGGTGTACAAACTCGAGTTTGTACACCAGCAACGTAGG,n/a
human,54868,TMEM104,XM_017024798.2,TRCN0000066786,NM_020001.1-532s1c1,GCTGAATGAGTCACTTTCTTA,pLKO.1,1039,CDS,81,90,,,Y,56620,Clec4n,CCGGGCTGAATGAGTCACTTTCTTACTCGAGTAAGAAAGTGACTCATTCAGCTTTTTG,AATTCAAAAAGCTGAATGAGTCACTTTCTTACTCGAGTAAGAAAGTGACTCATTCAGC,n/a
human,54868,TMEM104,XM_017024798.2,TRCN0000434193,NM_008665.4-1202s21c1,AGGAGGAGGAAGAAGATGAAG,pLKO_005,392,CDS,80,89,,,Y,17932,Myt1,CCGGAGGAGGAGGAAGAAGATGAAGCTCGAGCTTCATCTTCTTCCTCCTCCTTTTTTG,AATTCAAAAAAGGAGGAGGAAGAAGATGAAGCTCGAGCTTCATCTTCTTCCTCCTCCT,n/a
human,54868,TMEM104,XM_017024798.2,TRCN0000030036,NM_019637.2-903s1c1,CATGAGGAAGATGACGACTTT,pLKO.1,394,CDS,80,89,,,Y,56291,Styx,CCGGCATGAGGAAGATGACGACTTTCTCGAGAAAGTCGTCATCTTCCTCATGTTTTTG,AATTCAAAAACATGAGGAAGATGACGACTTTCTCGAGAAAGTCGTCATCTTCCTCATG,n/a
human,54868,TMEM104,XM_017024798.2,TRCN0000076515,NM_007751.1-106s1c1,ACAGTGGTTCCCAAAGCCCAT,pLKO.1,939,CDS,81,85,,,Y,12869,Cox8b,CCGGACAGTGGTTCCCAAAGCCCATCTCGAGATGGGCTTTGGGAACCACTGTTTTTTG,AATTCAAAAAACAGTGGTTCCCAAAGCCCATCTCGAGATGGGCTTTGGGAACCACTGT,n/a
human,54868,TMEM104,XM_017024798.2,TRCN0000357846,NM_012373.1-690s21c1,GGTAGCTGCTGTGCTGCAAAT,pLKO_005,58,5UTR,77,85,,,Y,8392,OR3A3,CCGGGGTAGCTGCTGTGCTGCAAATCTCGAGATTTGCAGCACAGCAGCTACCTTTTTG,AATTCAAAAAGGTAGCTGCTGTGCTGCAAATCTCGAGATTTGCAGCACAGCAGCTACC,n/a
human,54868,TMEM104,XM_017024798.2,TRCN0000239927,XM_914287.2-532s21c1,AGCGATTCCTCTGTGTCTGAT,pLKO_005,794,CDS,77,85,,,Y,638301,LOC638301,CCGGAGCGATTCCTCTGTGTCTGATCTCGAGATCAGACACAGAGGAATCGCTTTTTTG,AATTCAAAAAAGCGATTCCTCTGTGTCTGATCTCGAGATCAGACACAGAGGAATCGCT,n/a
