Taxon,"Gene ID","Gene Symbol",Transcript,"Clone ID","Legacy Clone Name","Target Seq",Vector,"Match Position","Match Region","Match %","SDR Match %","Intrinsic Score","Adjusted Score","Matches Other Gene in Same Taxon?","Orig. Target Gene ID","Orig. Target Gene Symbol","Forward Oligo Sequence","Reverse Oligo Sequence",Addgene
human,10045,SH2D3A,XM_017026124.1,TRCN0000072872,NM_005490.1-595s1c1,GCCTGCAGATTTGGCACATAT,pLKO.1,588,CDS,100,100,13.2,18.48,N,10045,SH2D3A,CCGGGCCTGCAGATTTGGCACATATCTCGAGATATGTGCCAAATCTGCAGGCTTTTTG,AATTCAAAAAGCCTGCAGATTTGGCACATATCTCGAGATATGTGCCAAATCTGCAGGC,n/a
human,10045,SH2D3A,XM_017026124.1,TRCN0000072869,NM_005490.1-417s1c1,CGGCTCTGGTTCACAGTTATA,pLKO.1,410,CDS,100,100,13.2,9.24,N,10045,SH2D3A,CCGGCGGCTCTGGTTCACAGTTATACTCGAGTATAACTGTGAACCAGAGCCGTTTTTG,AATTCAAAAACGGCTCTGGTTCACAGTTATACTCGAGTATAACTGTGAACCAGAGCCG,n/a
human,10045,SH2D3A,XM_017026124.1,TRCN0000072871,NM_005490.1-594s1c1,AGCCTGCAGATTTGGCACATA,pLKO.1,587,CDS,100,100,4.95,3.465,N,10045,SH2D3A,CCGGAGCCTGCAGATTTGGCACATACTCGAGTATGTGCCAAATCTGCAGGCTTTTTTG,AATTCAAAAAAGCCTGCAGATTTGGCACATACTCGAGTATGTGCCAAATCTGCAGGCT,n/a
human,10045,SH2D3A,XM_017026124.1,TRCN0000188166,NM_134185.1-486s1c1,CTGCTCACTCTTACCCATGAA,pLKO.1,809,CDS,90,95,,,N,171203,Vmn1r9,CCGGCTGCTCACTCTTACCCATGAACTCGAGTTCATGGGTAAGAGTGAGCAGTTTTTG,AATTCAAAAACTGCTCACTCTTACCCATGAACTCGAGTTCATGGGTAAGAGTGAGCAG,n/a
human,10045,SH2D3A,XM_017026124.1,TRCN0000166670,NM_017928.1-519s1c1,CTGAGGCTGTAGAAAGTGCTT,pLKO.1,87,5UTR,81,90,,,Y,55018,ANKRD40CL,CCGGCTGAGGCTGTAGAAAGTGCTTCTCGAGAAGCACTTTCTACAGCCTCAGTTTTTG,AATTCAAAAACTGAGGCTGTAGAAAGTGCTTCTCGAGAAGCACTTTCTACAGCCTCAG,n/a
human,10045,SH2D3A,XM_017026124.1,TRCN0000370062,NM_016407.3-1351s21c1,TGCAGAGTTGGCACATATTAA,pLKO_005,591,CDS,80,89,,,Y,51507,RTF2,CCGGTGCAGAGTTGGCACATATTAACTCGAGTTAATATGTGCCAACTCTGCATTTTTG,AATTCAAAAATGCAGAGTTGGCACATATTAACTCGAGTTAATATGTGCCAACTCTGCA,n/a
human,10045,SH2D3A,XM_017026124.1,TRCN0000234406,NM_011898.2-627s21c1,GAGGCCTGTGGAAAGTGTAAG,pLKO_005,89,5UTR,80,89,,,Y,24066,Spry4,CCGGGAGGCCTGTGGAAAGTGTAAGCTCGAGCTTACACTTTCCACAGGCCTCTTTTTG,AATTCAAAAAGAGGCCTGTGGAAAGTGTAAGCTCGAGCTTACACTTTCCACAGGCCTC,n/a
human,10045,SH2D3A,XM_017026124.1,TRCN0000003158,NM_003161.x-1561s1c1,CCCATGATCTCCAAACGGCCA,pLKO.1,910,CDS,80,89,,,Y,6198,RPS6KB1,CCGGCCCATGATCTCCAAACGGCCACTCGAGTGGCCGTTTGGAGATCATGGGTTTTTG,AATTCAAAAACCCATGATCTCCAAACGGCCACTCGAGTGGCCGTTTGGAGATCATGGG,n/a
human,10045,SH2D3A,XM_017026124.1,TRCN0000314934,NM_003161.2-1637s21c1,CCCATGATCTCCAAACGGCCA,pLKO_005,910,CDS,80,89,,,Y,6198,RPS6KB1,CCGGCCCATGATCTCCAAACGGCCACTCGAGTGGCCGTTTGGAGATCATGGGTTTTTG,AATTCAAAAACCCATGATCTCCAAACGGCCACTCGAGTGGCCGTTTGGAGATCATGGG,n/a
