Taxon,"Gene ID","Gene Symbol",Transcript,"Clone ID","Legacy Clone Name","Target Seq",Vector,"Match Position","Match Region","Match %","SDR Match %","Intrinsic Score","Adjusted Score","Matches Other Gene in Same Taxon?","Orig. Target Gene ID","Orig. Target Gene Symbol","Forward Oligo Sequence","Reverse Oligo Sequence",Addgene
human,7404,UTY,XM_017030073.2,TRCN0000229955,NM_007125.3-2862s21c1,GGCAACTAGCACTGGTATTAA,pLKO_005,2260,CDS,100,100,15,21,N,7404,UTY,CCGGGGCAACTAGCACTGGTATTAACTCGAGTTAATACCAGTGCTAGTTGCCTTTTTG,AATTCAAAAAGGCAACTAGCACTGGTATTAACTCGAGTTAATACCAGTGCTAGTTGCC,n/a
human,7404,UTY,XM_017030073.2,TRCN0000108116,NM_007125.3-2298s1c1,GCGAGCAAATAGAGATAATTT,pLKO.1,1648,CDS,100,100,15,12,N,7404,UTY,CCGGGCGAGCAAATAGAGATAATTTCTCGAGAAATTATCTCTATTTGCTCGCTTTTTG,AATTCAAAAAGCGAGCAAATAGAGATAATTTCTCGAGAAATTATCTCTATTTGCTCGC,n/a
human,7404,UTY,XM_017030073.2,TRCN0000108117,NM_007125.3-2633s1c1,GCAGTAATTGTATAGCAGGAA,pLKO.1,1983,CDS,100,100,2.64,1.848,N,7404,UTY,CCGGGCAGTAATTGTATAGCAGGAACTCGAGTTCCTGCTATACAATTACTGCTTTTTG,AATTCAAAAAGCAGTAATTGTATAGCAGGAACTCGAGTTCCTGCTATACAATTACTGC,n/a
human,7404,UTY,XM_017030073.2,TRCN0000218022,NM_007125.3-2001s21c1,GGATGCTTTACAGGCATATAT,pLKO_005,1351,CDS,100,100,15,9,N,7404,UTY,CCGGGGATGCTTTACAGGCATATATCTCGAGATATATGCCTGTAAAGCATCCTTTTTG,AATTCAAAAAGGATGCTTTACAGGCATATATCTCGAGATATATGCCTGTAAAGCATCC,n/a
human,7404,UTY,XM_017030073.2,TRCN0000229956,NM_007125.3-3657s21c1,TCCACCCACACCTAGTATTTA,pLKO_005,3055,CDS,100,100,15,9,N,7404,UTY,CCGGTCCACCCACACCTAGTATTTACTCGAGTAAATACTAGGTGTGGGTGGATTTTTG,AATTCAAAAATCCACCCACACCTAGTATTTACTCGAGTAAATACTAGGTGTGGGTGGA,n/a
human,7404,UTY,XM_017030073.2,TRCN0000096242,NM_009483.1-581s1c1,GCTACGAATCTCTAATCTTAA,pLKO.1,582,CDS,95,95,,,Y,22289,Kdm6a,CCGGGCTACGAATCTCTAATCTTAACTCGAGTTAAGATTAGAGATTCGTAGCTTTTTG,AATTCAAAAAGCTACGAATCTCTAATCTTAACTCGAGTTAAGATTAGAGATTCGTAGC,n/a
human,7404,UTY,XM_017030073.2,TRCN0000331919,NM_009483.1-581s21c1,GCTACGAATCTCTAATCTTAA,pLKO_005,582,CDS,95,95,,,Y,22289,Kdm6a,CCGGGCTACGAATCTCTAATCTTAACTCGAGTTAAGATTAGAGATTCGTAGCTTTTTG,AATTCAAAAAGCTACGAATCTCTAATCTTAACTCGAGTTAAGATTAGAGATTCGTAGC,n/a
human,7404,UTY,XM_017030073.2,TRCN0000095070,NM_009484.1-809s1c1,GCACCATAATATGGATCTAAT,pLKO.1,1102,CDS,90,95,,,N,22290,Uty,CCGGGCACCATAATATGGATCTAATCTCGAGATTAGATCCATATTATGGTGCTTTTTG,AATTCAAAAAGCACCATAATATGGATCTAATCTCGAGATTAGATCCATATTATGGTGC,n/a
human,7404,UTY,XM_017030073.2,TRCN0000095071,NM_009484.1-1113s1c1,GCCTGGATGGACTTAGGTATT,pLKO.1,1406,CDS,90,95,,,N,22290,Uty,CCGGGCCTGGATGGACTTAGGTATTCTCGAGAATACCTAAGTCCATCCAGGCTTTTTG,AATTCAAAAAGCCTGGATGGACTTAGGTATTCTCGAGAATACCTAAGTCCATCCAGGC,n/a
human,7404,UTY,XM_017030073.2,TRCN0000095073,NM_009484.1-808s1c1,TGCACCATAATATGGATCTAA,pLKO.1,1101,CDS,90,95,,,N,22290,Uty,CCGGTGCACCATAATATGGATCTAACTCGAGTTAGATCCATATTATGGTGCATTTTTG,AATTCAAAAATGCACCATAATATGGATCTAACTCGAGTTAGATCCATATTATGGTGCA,n/a
human,7404,UTY,XM_017030073.2,TRCN0000096243,NM_009483.1-2821s1c1,CCTTCTCCTAAGTCCACTGAA,pLKO.1,2726,CDS,90,95,,,N,22289,Kdm6a,CCGGCCTTCTCCTAAGTCCACTGAACTCGAGTTCAGTGGACTTAGGAGAAGGTTTTTG,AATTCAAAAACCTTCTCCTAAGTCCACTGAACTCGAGTTCAGTGGACTTAGGAGAAGG,n/a
human,7404,UTY,XM_017030073.2,TRCN0000242894,NM_152499.1-235s21c1,CGCGAAGTGAAGAGGATTCTG,pLKO_005,440,CDS,90,90,,,Y,149473,CCDC24,CCGGCGCGAAGTGAAGAGGATTCTGCTCGAGCAGAATCCTCTTCACTTCGCGTTTTTG,AATTCAAAAACGCGAAGTGAAGAGGATTCTGCTCGAGCAGAATCCTCTTCACTTCGCG,n/a
human,7404,UTY,XM_017030073.2,TRCN0000162624,NM_020317.3-978s1c1,CCAGCAAAGAAGCATAGCTTT,pLKO.1,1673,CDS,81,90,,,Y,57035,RSRP1,CCGGCCAGCAAAGAAGCATAGCTTTCTCGAGAAAGCTATGCTTCTTTGCTGGTTTTTG,AATTCAAAAACCAGCAAAGAAGCATAGCTTTCTCGAGAAAGCTATGCTTCTTTGCTGG,n/a
human,7404,UTY,XM_017030073.2,TRCN0000305301,NM_009483.1-778s21c1,GCATTTCAGTGGGCTATTAAA,pLKO_005,779,CDS,90,89,,,Y,22289,Kdm6a,CCGGGCATTTCAGTGGGCTATTAAACTCGAGTTTAATAGCCCACTGAAATGCTTTTTG,AATTCAAAAAGCATTTCAGTGGGCTATTAAACTCGAGTTTAATAGCCCACTGAAATGC,n/a
human,7404,UTY,XM_017030073.2,TRCN0000075284,NM_031213.2-887s1c1,CCACTGCAACATCTTCTCCTA,pLKO.1,2715,CDS,90,89,,,Y,81926,ABHD17A,CCGGCCACTGCAACATCTTCTCCTACTCGAGTAGGAGAAGATGTTGCAGTGGTTTTTG,AATTCAAAAACCACTGCAACATCTTCTCCTACTCGAGTAGGAGAAGATGTTGCAGTGG,n/a
human,7404,UTY,XM_017030073.2,TRCN0000296309,NM_000950.2-1244s21c1,CCATTAACTTCTACCTAAATC,pLKO_005,1458,CDS,85,89,,,Y,5638,PRRG1,CCGGCCATTAACTTCTACCTAAATCCTCGAGGATTTAGGTAGAAGTTAATGGTTTTTG,AATTCAAAAACCATTAACTTCTACCTAAATCCTCGAGGATTTAGGTAGAAGTTAATGG,n/a
human,7404,UTY,XM_017030073.2,TRCN0000003487,NM_000063.x-2208s1c1,GCCACGAGACTTTCACATCAA,pLKO.1,1566,CDS,85,89,,,Y,717,C2,CCGGGCCACGAGACTTTCACATCAACTCGAGTTGATGTGAAAGTCTCGTGGCTTTTTG,AATTCAAAAAGCCACGAGACTTTCACATCAACTCGAGTTGATGTGAAAGTCTCGTGGC,n/a
human,7404,UTY,XM_017030073.2,TRCN0000036894,NM_016541.1-233s1c1,ACCTGATGAAGAACAACCCAT,pLKO.1,2209,CDS,85,89,,,Y,51764,GNG13,CCGGACCTGATGAAGAACAACCCATCTCGAGATGGGTTGTTCTTCATCAGGTTTTTTG,AATTCAAAAAACCTGATGAAGAACAACCCATCTCGAGATGGGTTGTTCTTCATCAGGT,n/a
human,7404,UTY,XM_017030073.2,TRCN0000308263,NM_001834.2-385s21c1,CACAGTCAATGGAGATGTGTT,pLKO_005,2800,CDS,85,89,,,Y,1212,CLTB,CCGGCACAGTCAATGGAGATGTGTTCTCGAGAACACATCTCCATTGACTGTGTTTTTG,AATTCAAAAACACAGTCAATGGAGATGTGTTCTCGAGAACACATCTCCATTGACTGTG,n/a
human,7404,UTY,XM_017030073.2,TRCN0000110899,NM_011166.1-355s1c1,GCCGGGTGTATTCCTTGTGAA,pLKO.1,1922,CDS,80,89,,,N,19111,Prl6a1,CCGGGCCGGGTGTATTCCTTGTGAACTCGAGTTCACAAGGAATACACCCGGCTTTTTG,AATTCAAAAAGCCGGGTGTATTCCTTGTGAACTCGAGTTCACAAGGAATACACCCGGC,n/a
human,7404,UTY,XM_017030073.2,TRCN0000218066,XM_001006405.1-986s21c1,ATGGTCTACTTCAACTACATG,pLKO_005,758,CDS,80,89,,,Y,545793,AB010352,CCGGATGGTCTACTTCAACTACATGCTCGAGCATGTAGTTGAAGTAGACCATTTTTTG,AATTCAAAAAATGGTCTACTTCAACTACATGCTCGAGCATGTAGTTGAAGTAGACCAT,n/a
human,7404,UTY,XM_017030073.2,TRCN0000142424,NM_015077.1-1770s1c1,GCAACTTTGTGTTGGTGCTAT,pLKO.1,69,5UTR,80,89,,,Y,23098,SARM1,CCGGGCAACTTTGTGTTGGTGCTATCTCGAGATAGCACCAACACAAAGTTGCTTTTTG,AATTCAAAAAGCAACTTTGTGTTGGTGCTATCTCGAGATAGCACCAACACAAAGTTGC,n/a
human,7404,UTY,XM_017030073.2,TRCN0000018127,NM_015035.2-1943s1c1,GCGAAGTTGAACATCTCACAA,pLKO.1,2285,CDS,80,89,,,Y,23051,ZHX3,CCGGGCGAAGTTGAACATCTCACAACTCGAGTTGTGAGATGTTCAACTTCGCTTTTTG,AATTCAAAAAGCGAAGTTGAACATCTCACAACTCGAGTTGTGAGATGTTCAACTTCGC,n/a
human,7404,UTY,XM_017030073.2,TRCN0000353580,NM_015035.3-1943s21c1,GCGAAGTTGAACATCTCACAA,pLKO_005,2285,CDS,80,89,,,Y,23051,ZHX3,CCGGGCGAAGTTGAACATCTCACAACTCGAGTTGTGAGATGTTCAACTTCGCTTTTTG,AATTCAAAAAGCGAAGTTGAACATCTCACAACTCGAGTTGTGAGATGTTCAACTTCGC,n/a
human,7404,UTY,XM_017030073.2,TRCN0000158930,NM_003007.2-1330s1c1,GTAATTATAGAGCAGGAAGAT,pLKO.1,1986,CDS,80,89,,,Y,6406,SEMG1,CCGGGTAATTATAGAGCAGGAAGATCTCGAGATCTTCCTGCTCTATAATTACTTTTTG,AATTCAAAAAGTAATTATAGAGCAGGAAGATCTCGAGATCTTCCTGCTCTATAATTAC,n/a
human,7404,UTY,XM_017030073.2,TRCN0000161599,NM_207385.1-227s1c1,GCTGAGACACAAAGAAGTTAA,pLKO.1,1729,CDS,80,89,,,Y,,,CCGGGCTGAGACACAAAGAAGTTAACTCGAGTTAACTTCTTTGTGTCTCAGCTTTTTG,AATTCAAAAAGCTGAGACACAAAGAAGTTAACTCGAGTTAACTTCTTTGTGTCTCAGC,n/a
human,7404,UTY,XM_017030073.2,TRCN0000001680,NM_009915.x-684s1c1,CCTCTCTACCAGGAATCATAT,pLKO.1,3366,CDS,80,89,,,Y,12772,Ccr2,CCGGCCTCTCTACCAGGAATCATATCTCGAGATATGATTCCTGGTAGAGAGGTTTTTG,AATTCAAAAACCTCTCTACCAGGAATCATATCTCGAGATATGATTCCTGGTAGAGAGG,n/a
human,7404,UTY,XM_017030073.2,TRCN0000245860,NM_001080441.1-132s21c1,TCAAGCACAGCTGGAACAGTC,pLKO_005,1680,CDS,81,85,,,Y,143941,TTC36,CCGGTCAAGCACAGCTGGAACAGTCCTCGAGGACTGTTCCAGCTGTGCTTGATTTTTG,AATTCAAAAATCAAGCACAGCTGGAACAGTCCTCGAGGACTGTTCCAGCTGTGCTTGA,n/a
