Taxon,"Gene ID","Gene Symbol",Transcript,"Clone ID","Legacy Clone Name","Target Seq",Vector,"Match Position","Match Region","Match %","SDR Match %","Intrinsic Score","Adjusted Score","Matches Other Gene in Same Taxon?","Orig. Target Gene ID","Orig. Target Gene Symbol","Forward Oligo Sequence","Reverse Oligo Sequence",Addgene
mouse,240058,Cpne5,XM_017317468.1,TRCN0000111705,NM_153166.1-2885s1c1,CGCATGGTGATAGTGATGTTT,pLKO.1,1957,3UTR,100,100,5.625,4.5,N,240058,Cpne5,CCGGCGCATGGTGATAGTGATGTTTCTCGAGAAACATCACTATCACCATGCGTTTTTG,AATTCAAAAACGCATGGTGATAGTGATGTTTCTCGAGAAACATCACTATCACCATGCG,n/a
mouse,240058,Cpne5,XM_017317468.1,TRCN0000111709,NM_153166.1-1538s1c1,CCTATGTCGATCATCATTGTT,pLKO.1,610,CDS,100,100,5.625,3.9375,N,240058,Cpne5,CCGGCCTATGTCGATCATCATTGTTCTCGAGAACAATGATGATCGACATAGGTTTTTG,AATTCAAAAACCTATGTCGATCATCATTGTTCTCGAGAACAATGATGATCGACATAGG,n/a
mouse,240058,Cpne5,XM_017317468.1,TRCN0000111707,NM_153166.1-1385s1c1,CCCACTAACTTTGCTCCTGTT,pLKO.1,457,CDS,100,100,4.05,2.835,N,240058,Cpne5,CCGGCCCACTAACTTTGCTCCTGTTCTCGAGAACAGGAGCAAAGTTAGTGGGTTTTTG,AATTCAAAAACCCACTAACTTTGCTCCTGTTCTCGAGAACAGGAGCAAAGTTAGTGGG,n/a
mouse,240058,Cpne5,XM_017317468.1,TRCN0000418238,NM_153166.2-1190s21c1,CATTCAGCATTATGACAGTGA,pLKO_005,273,CDS,100,100,2.64,1.848,N,240058,Cpne5,CCGGCATTCAGCATTATGACAGTGACTCGAGTCACTGTCATAATGCTGAATGTTTTTG,AATTCAAAAACATTCAGCATTATGACAGTGACTCGAGTCACTGTCATAATGCTGAATG,n/a
mouse,240058,Cpne5,XM_017317468.1,TRCN0000242597,NM_032389.3-1473s21c1,AGCGGACATTGCCCAGTTTAA,pLKO_005,713,CDS,81,90,,,Y,84364,ARFGAP2,CCGGAGCGGACATTGCCCAGTTTAACTCGAGTTAAACTGGGCAATGTCCGCTTTTTTG,AATTCAAAAAAGCGGACATTGCCCAGTTTAACTCGAGTTAAACTGGGCAATGTCCGCT,n/a
mouse,240058,Cpne5,XM_017317468.1,TRCN0000271412,NM_005798.3-1228s21c1,ATGTTCCTAGAATGGTCATTA,pLKO_005,1379,3UTR,85,89,,,Y,10206,TRIM13,CCGGATGTTCCTAGAATGGTCATTACTCGAGTAATGACCATTCTAGGAACATTTTTTG,AATTCAAAAAATGTTCCTAGAATGGTCATTACTCGAGTAATGACCATTCTAGGAACAT,n/a
mouse,240058,Cpne5,XM_017317468.1,TRCN0000007030,NM_152928.1-1652s1c1,CGCGACATTGTGCAGTTTGTA,pLKO.1,715,CDS,85,89,,,Y,8904,CPNE1,CCGGCGCGACATTGTGCAGTTTGTACTCGAGTACAAACTGCACAATGTCGCGTTTTTG,AATTCAAAAACGCGACATTGTGCAGTTTGTACTCGAGTACAAACTGCACAATGTCGCG,n/a
mouse,240058,Cpne5,XM_017317468.1,TRCN0000163529,NM_016016.1-508s1c1,GCCATCTACTTCACTGCCTAT,pLKO.1,160,5UTR,85,89,,,Y,51629,SLC25A39,CCGGGCCATCTACTTCACTGCCTATCTCGAGATAGGCAGTGAAGTAGATGGCTTTTTG,AATTCAAAAAGCCATCTACTTCACTGCCTATCTCGAGATAGGCAGTGAAGTAGATGGC,n/a
mouse,240058,Cpne5,XM_017317468.1,TRCN0000142011,NM_014949.2-2534s1c1,GCCCTTCTAAGATCCTGTCTT,pLKO.1,1794,3UTR,80,89,,,N,22889,KHDC4,CCGGGCCCTTCTAAGATCCTGTCTTCTCGAGAAGACAGGATCTTAGAAGGGCTTTTTG,AATTCAAAAAGCCCTTCTAAGATCCTGTCTTCTCGAGAAGACAGGATCTTAGAAGGGC,n/a
