Taxon,"Gene ID","Gene Symbol",Transcript,"Clone ID","Legacy Clone Name","Target Seq",Vector,"Match Position","Match Region","Match %","SDR Match %","Intrinsic Score","Adjusted Score","Matches Other Gene in Same Taxon?","Orig. Target Gene ID","Orig. Target Gene Symbol","Forward Oligo Sequence","Reverse Oligo Sequence",Addgene
human,101928669,LOC101928669,XR_001756108.1,TRCN0000159185,NM_001033515.1-103s1c1,GAGCAACAAGAAACGAATAAA,pLKO.1,228,3UTR,100,100,15,7.5,Y,100132288,TEKT4P2,CCGGGAGCAACAAGAAACGAATAAACTCGAGTTTATTCGTTTCTTGTTGCTCTTTTTG,AATTCAAAAAGAGCAACAAGAAACGAATAAACTCGAGTTTATTCGTTTCTTGTTGCTC,n/a
human,101928669,LOC101928669,XR_001756108.1,TRCN0000159736,NM_001033515.1-105s1c1,GCAACAAGAAACGAATAAATC,pLKO.1,230,3UTR,100,100,13.2,6.6,Y,100132288,TEKT4P2,CCGGGCAACAAGAAACGAATAAATCCTCGAGGATTTATTCGTTTCTTGTTGCTTTTTG,AATTCAAAAAGCAACAAGAAACGAATAAATCCTCGAGGATTTATTCGTTTCTTGTTGC,n/a
human,101928669,LOC101928669,XR_001756108.1,TRCN0000161734,NM_001033515.1-99s1c1,CCAAGAGCAACAAGAAACGAA,pLKO.1,224,3UTR,100,100,3,1.5,Y,100132288,TEKT4P2,CCGGCCAAGAGCAACAAGAAACGAACTCGAGTTCGTTTCTTGTTGCTCTTGGTTTTTG,AATTCAAAAACCAAGAGCAACAAGAAACGAACTCGAGTTCGTTTCTTGTTGCTCTTGG,n/a
human,101928669,LOC101928669,XR_001756108.1,TRCN0000216676,NM_177651.3-367s1c1,CAAAGACATCTGACCACAATG,pLKO.1,336,3UTR,81,90,,,N,227998,4933409G03Rik,CCGGCAAAGACATCTGACCACAATGCTCGAGCATTGTGGTCAGATGTCTTTGTTTTTG,AATTCAAAAACAAAGACATCTGACCACAATGCTCGAGCATTGTGGTCAGATGTCTTTG,n/a
human,101928669,LOC101928669,XR_001756108.1,TRCN0000083716,NM_004870.1-295s1c1,CATCACTAACAACTTCCCATT,pLKO.1,616,3UTR,81,90,,,Y,9526,MPDU1,CCGGCATCACTAACAACTTCCCATTCTCGAGAATGGGAAGTTGTTAGTGATGTTTTTG,AATTCAAAAACATCACTAACAACTTCCCATTCTCGAGAATGGGAAGTTGTTAGTGATG,n/a
human,101928669,LOC101928669,XR_001756108.1,TRCN0000361998,NM_183152.2-485s21c1,AGAGCCTGAAGTGCGCTATTA,pLKO_005,180,3UTR,81,90,,,Y,216166,Plk5,CCGGAGAGCCTGAAGTGCGCTATTACTCGAGTAATAGCGCACTTCAGGCTCTTTTTTG,AATTCAAAAAAGAGCCTGAAGTGCGCTATTACTCGAGTAATAGCGCACTTCAGGCTCT,n/a
human,101928669,LOC101928669,XR_001756108.1,TRCN0000336014,NM_011515.4-321s21c1,TTTGTATCACTGATGATGATT,pLKO_005,585,3UTR,85,89,,,Y,20955,Vamp7,CCGGTTTGTATCACTGATGATGATTCTCGAGAATCATCATCAGTGATACAAATTTTTG,AATTCAAAAATTTGTATCACTGATGATGATTCTCGAGAATCATCATCAGTGATACAAA,n/a
human,101928669,LOC101928669,XR_001756108.1,TRCN0000306518,NM_019812.2-2617s21c1,CTAGACCAAAGAATGGTATTT,pLKO_005,1186,3UTR,80,89,,,Y,93759,Sirt1,CCGGCTAGACCAAAGAATGGTATTTCTCGAGAAATACCATTCTTTGGTCTAGTTTTTG,AATTCAAAAACTAGACCAAAGAATGGTATTTCTCGAGAAATACCATTCTTTGGTCTAG,n/a
human,101928669,LOC101928669,XR_001756108.1,TRCN0000337315,NM_001145720.1-1630s21c1,GTTGTTGAAAGATACCATTTG,pLKO_005,251,3UTR,86,85,,,Y,728116,ZBTB8B,CCGGGTTGTTGAAAGATACCATTTGCTCGAGCAAATGGTATCTTTCAACAACTTTTTG,AATTCAAAAAGTTGTTGAAAGATACCATTTGCTCGAGCAAATGGTATCTTTCAACAAC,n/a
human,101928669,LOC101928669,XR_001756108.1,TRCN0000150166,NM_003352.3-869s1c1,CCTTTCCTTAACTTGAAGCTA,pLKO.1,528,3UTR,81,85,,,Y,7341,SUMO1,CCGGCCTTTCCTTAACTTGAAGCTACTCGAGTAGCTTCAAGTTAAGGAAAGGTTTTTG,AATTCAAAAACCTTTCCTTAACTTGAAGCTACTCGAGTAGCTTCAAGTTAAGGAAAGG,n/a
human,101928669,LOC101928669,XR_001756108.1,TRCN0000105560,NM_053197.2-2264s1c1,CCTTTCTTTCTCTCTTTCTTT,pLKO.1,435,3UTR,77,85,,,Y,94280,Sfxn3,CCGGCCTTTCTTTCTCTCTTTCTTTCTCGAGAAAGAAAGAGAGAAAGAAAGGTTTTTG,AATTCAAAAACCTTTCTTTCTCTCTTTCTTTCTCGAGAAAGAAAGAGAGAAAGAAAGG,n/a
