Taxon,"Gene ID","Gene Symbol",Transcript,"Clone ID","Legacy Clone Name","Target Seq",Vector,"Match Position","Match Region","Match %","SDR Match %","Intrinsic Score","Adjusted Score","Matches Other Gene in Same Taxon?","Orig. Target Gene ID","Orig. Target Gene Symbol","Forward Oligo Sequence","Reverse Oligo Sequence",Addgene
human,101928669,LOC101928669,XR_001756110.1,TRCN0000159185,NM_001033515.1-103s1c1,GAGCAACAAGAAACGAATAAA,pLKO.1,228,3UTR,100,100,15,7.5,Y,100132288,TEKT4P2,CCGGGAGCAACAAGAAACGAATAAACTCGAGTTTATTCGTTTCTTGTTGCTCTTTTTG,AATTCAAAAAGAGCAACAAGAAACGAATAAACTCGAGTTTATTCGTTTCTTGTTGCTC,n/a
human,101928669,LOC101928669,XR_001756110.1,TRCN0000159736,NM_001033515.1-105s1c1,GCAACAAGAAACGAATAAATC,pLKO.1,230,3UTR,100,100,13.2,6.6,Y,100132288,TEKT4P2,CCGGGCAACAAGAAACGAATAAATCCTCGAGGATTTATTCGTTTCTTGTTGCTTTTTG,AATTCAAAAAGCAACAAGAAACGAATAAATCCTCGAGGATTTATTCGTTTCTTGTTGC,n/a
human,101928669,LOC101928669,XR_001756110.1,TRCN0000161734,NM_001033515.1-99s1c1,CCAAGAGCAACAAGAAACGAA,pLKO.1,224,3UTR,100,100,3,1.5,Y,100132288,TEKT4P2,CCGGCCAAGAGCAACAAGAAACGAACTCGAGTTCGTTTCTTGTTGCTCTTGGTTTTTG,AATTCAAAAACCAAGAGCAACAAGAAACGAACTCGAGTTCGTTTCTTGTTGCTCTTGG,n/a
human,101928669,LOC101928669,XR_001756110.1,TRCN0000361998,NM_183152.2-485s21c1,AGAGCCTGAAGTGCGCTATTA,pLKO_005,180,3UTR,81,90,,,Y,216166,Plk5,CCGGAGAGCCTGAAGTGCGCTATTACTCGAGTAATAGCGCACTTCAGGCTCTTTTTTG,AATTCAAAAAAGAGCCTGAAGTGCGCTATTACTCGAGTAATAGCGCACTTCAGGCTCT,n/a
human,101928669,LOC101928669,XR_001756110.1,TRCN0000006413,NM_004439.3-3190s1c1,TGAATGATTCTGCACTTTGTA,pLKO.1,366,3UTR,85,89,,,Y,2044,EPHA5,CCGGTGAATGATTCTGCACTTTGTACTCGAGTACAAAGTGCAGAATCATTCATTTTTG,AATTCAAAAATGAATGATTCTGCACTTTGTACTCGAGTACAAAGTGCAGAATCATTCA,n/a
human,101928669,LOC101928669,XR_001756110.1,TRCN0000019423,NM_002097.1-875s1c1,CGCAAAGATTACCTTAAGCAA,pLKO.1,474,3UTR,85,89,,,Y,2971,GTF3A,CCGGCGCAAAGATTACCTTAAGCAACTCGAGTTGCTTAAGGTAATCTTTGCGTTTTTG,AATTCAAAAACGCAAAGATTACCTTAAGCAACTCGAGTTGCTTAAGGTAATCTTTGCG,n/a
human,101928669,LOC101928669,XR_001756110.1,TRCN0000285108,NM_002097.2-876s21c1,CGCAAAGATTACCTTAAGCAA,pLKO_005,474,3UTR,85,89,,,Y,2971,GTF3A,CCGGCGCAAAGATTACCTTAAGCAACTCGAGTTGCTTAAGGTAATCTTTGCGTTTTTG,AATTCAAAAACGCAAAGATTACCTTAAGCAACTCGAGTTGCTTAAGGTAATCTTTGCG,n/a
human,101928669,LOC101928669,XR_001756110.1,TRCN0000337315,NM_001145720.1-1630s21c1,GTTGTTGAAAGATACCATTTG,pLKO_005,251,3UTR,86,85,,,Y,728116,ZBTB8B,CCGGGTTGTTGAAAGATACCATTTGCTCGAGCAAATGGTATCTTTCAACAACTTTTTG,AATTCAAAAAGTTGTTGAAAGATACCATTTGCTCGAGCAAATGGTATCTTTCAACAAC,n/a
human,101928669,LOC101928669,XR_001756110.1,TRCN0000085307,NM_145622.1-617s1c1,GCCTTCCACTTTCCATCATTA,pLKO.1,418,3UTR,77,85,,,Y,235907,Zfp65,CCGGGCCTTCCACTTTCCATCATTACTCGAGTAATGATGGAAAGTGGAAGGCTTTTTG,AATTCAAAAAGCCTTCCACTTTCCATCATTACTCGAGTAATGATGGAAAGTGGAAGGC,n/a
human,101928669,LOC101928669,XR_001756110.1,TRCN0000432553,NM_009043.1-297s21c1,GCAGGTCACCTGGTGTCAATA,pLKO_005,608,3UTR,77,85,,,Y,19693,Reg2,CCGGGCAGGTCACCTGGTGTCAATACTCGAGTATTGACACCAGGTGACCTGCTTTTTG,AATTCAAAAAGCAGGTCACCTGGTGTCAATACTCGAGTATTGACACCAGGTGACCTGC,n/a
