Taxon,"Gene ID","Gene Symbol",Transcript,"Clone ID","Legacy Clone Name","Target Seq",Vector,"Match Position","Match Region","Match %","SDR Match %","Intrinsic Score","Adjusted Score","Matches Other Gene in Same Taxon?","Orig. Target Gene ID","Orig. Target Gene Symbol","Forward Oligo Sequence","Reverse Oligo Sequence",Addgene
human,101928669,LOC101928669,XR_001756118.1,TRCN0000159185,NM_001033515.1-103s1c1,GAGCAACAAGAAACGAATAAA,pLKO.1,421,3UTR,100,100,15,7.5,Y,100132288,TEKT4P2,CCGGGAGCAACAAGAAACGAATAAACTCGAGTTTATTCGTTTCTTGTTGCTCTTTTTG,AATTCAAAAAGAGCAACAAGAAACGAATAAACTCGAGTTTATTCGTTTCTTGTTGCTC,n/a
human,101928669,LOC101928669,XR_001756118.1,TRCN0000159736,NM_001033515.1-105s1c1,GCAACAAGAAACGAATAAATC,pLKO.1,423,3UTR,100,100,13.2,6.6,Y,100132288,TEKT4P2,CCGGGCAACAAGAAACGAATAAATCCTCGAGGATTTATTCGTTTCTTGTTGCTTTTTG,AATTCAAAAAGCAACAAGAAACGAATAAATCCTCGAGGATTTATTCGTTTCTTGTTGC,n/a
human,101928669,LOC101928669,XR_001756118.1,TRCN0000161734,NM_001033515.1-99s1c1,CCAAGAGCAACAAGAAACGAA,pLKO.1,417,3UTR,100,100,3,1.5,Y,100132288,TEKT4P2,CCGGCCAAGAGCAACAAGAAACGAACTCGAGTTCGTTTCTTGTTGCTCTTGGTTTTTG,AATTCAAAAACCAAGAGCAACAAGAAACGAACTCGAGTTCGTTTCTTGTTGCTCTTGG,n/a
human,101928669,LOC101928669,XR_001756118.1,TRCN0000128966,NM_145055.1-83s1c1,GAAGAACTCATTGAGTCCGAA,pLKO.1,197,3UTR,80,89,,,Y,147339,C18orf25,CCGGGAAGAACTCATTGAGTCCGAACTCGAGTTCGGACTCAATGAGTTCTTCTTTTTG,AATTCAAAAAGAAGAACTCATTGAGTCCGAACTCGAGTTCGGACTCAATGAGTTCTTC,n/a
human,101928669,LOC101928669,XR_001756118.1,TRCN0000140039,NM_017539.1-283s1c1,GCACCCTTCAAAGAACAGCAT,pLKO.1,319,3UTR,80,89,,,Y,55567,DNAH3,CCGGGCACCCTTCAAAGAACAGCATCTCGAGATGCTGTTCTTTGAAGGGTGCTTTTTG,AATTCAAAAAGCACCCTTCAAAGAACAGCATCTCGAGATGCTGTTCTTTGAAGGGTGC,n/a
human,101928669,LOC101928669,XR_001756118.1,TRCN0000160209,NM_016430.2-589s1c1,CAGCCTTAAGAGATATTTCTA,pLKO.1,247,3UTR,80,89,,,Y,51227,PIGP,CCGGCAGCCTTAAGAGATATTTCTACTCGAGTAGAAATATCTCTTAAGGCTGTTTTTG,AATTCAAAAACAGCCTTAAGAGATATTTCTACTCGAGTAGAAATATCTCTTAAGGCTG,n/a
human,101928669,LOC101928669,XR_001756118.1,TRCN0000285559,NM_153681.2-614s21c1,CAGCCTTAAGAGATATTTCTA,pLKO_005,247,3UTR,80,89,,,Y,51227,PIGP,CCGGCAGCCTTAAGAGATATTTCTACTCGAGTAGAAATATCTCTTAAGGCTGTTTTTG,AATTCAAAAACAGCCTTAAGAGATATTTCTACTCGAGTAGAAATATCTCTTAAGGCTG,n/a
human,101928669,LOC101928669,XR_001756118.1,TRCN0000344028,NM_018992.3-774s21c1,GACAGCTGAAGAAATGATTTA,pLKO_005,523,3UTR,77,85,,,Y,54442,KCTD5,CCGGGACAGCTGAAGAAATGATTTACTCGAGTAAATCATTTCTTCAGCTGTCTTTTTG,AATTCAAAAAGACAGCTGAAGAAATGATTTACTCGAGTAAATCATTTCTTCAGCTGTC,n/a
