Taxon,"Gene ID","Gene Symbol",Transcript,"Clone ID","Legacy Clone Name","Target Seq",Vector,"Match Position","Match Region","Match %","SDR Match %","Intrinsic Score","Adjusted Score","Matches Other Gene in Same Taxon?","Orig. Target Gene ID","Orig. Target Gene Symbol","Forward Oligo Sequence","Reverse Oligo Sequence",Addgene
human,102723347,LOC102723347,XR_001756162.2,TRCN0000159185,NM_001033515.1-103s1c1,GAGCAACAAGAAACGAATAAA,pLKO.1,334,3UTR,100,100,15,7.5,Y,100132288,TEKT4P2,CCGGGAGCAACAAGAAACGAATAAACTCGAGTTTATTCGTTTCTTGTTGCTCTTTTTG,AATTCAAAAAGAGCAACAAGAAACGAATAAACTCGAGTTTATTCGTTTCTTGTTGCTC,n/a
human,102723347,LOC102723347,XR_001756162.2,TRCN0000159736,NM_001033515.1-105s1c1,GCAACAAGAAACGAATAAATC,pLKO.1,336,3UTR,100,100,13.2,6.6,Y,100132288,TEKT4P2,CCGGGCAACAAGAAACGAATAAATCCTCGAGGATTTATTCGTTTCTTGTTGCTTTTTG,AATTCAAAAAGCAACAAGAAACGAATAAATCCTCGAGGATTTATTCGTTTCTTGTTGC,n/a
human,102723347,LOC102723347,XR_001756162.2,TRCN0000161734,NM_001033515.1-99s1c1,CCAAGAGCAACAAGAAACGAA,pLKO.1,330,3UTR,100,100,3,1.5,Y,100132288,TEKT4P2,CCGGCCAAGAGCAACAAGAAACGAACTCGAGTTCGTTTCTTGTTGCTCTTGGTTTTTG,AATTCAAAAACCAAGAGCAACAAGAAACGAACTCGAGTTCGTTTCTTGTTGCTCTTGG,n/a
human,102723347,LOC102723347,XR_001756162.2,TRCN0000166101,NM_152340.1-404s1c1,GCTGGAGTACAATGGCACAAT,pLKO.1,386,3UTR,95,95,,,Y,652276,LOC652276,CCGGGCTGGAGTACAATGGCACAATCTCGAGATTGTGCCATTGTACTCCAGCTTTTTG,AATTCAAAAAGCTGGAGTACAATGGCACAATCTCGAGATTGTGCCATTGTACTCCAGC,n/a
human,102723347,LOC102723347,XR_001756162.2,TRCN0000033647,NM_206595.1-956s1c1,CCTCACTACACTGTGTGACTT,pLKO.1,35,3UTR,85,89,,,Y,2104,ESRRG,CCGGCCTCACTACACTGTGTGACTTCTCGAGAAGTCACACAGTGTAGTGAGGTTTTTG,AATTCAAAAACCTCACTACACTGTGTGACTTCTCGAGAAGTCACACAGTGTAGTGAGG,n/a
human,102723347,LOC102723347,XR_001756162.2,TRCN0000163352,NM_152340.1-408s1c1,GAGTACAATGGCACAATCTTG,pLKO.1,390,3UTR,85,89,,,Y,652276,LOC652276,CCGGGAGTACAATGGCACAATCTTGCTCGAGCAAGATTGTGCCATTGTACTCTTTTTG,AATTCAAAAAGAGTACAATGGCACAATCTTGCTCGAGCAAGATTGTGCCATTGTACTC,n/a
human,102723347,LOC102723347,XR_001756162.2,TRCN0000165704,NM_152340.1-413s1c1,CAATGGCACAATCTTGGCTCA,pLKO.1,395,3UTR,85,89,,,Y,652276,LOC652276,CCGGCAATGGCACAATCTTGGCTCACTCGAGTGAGCCAAGATTGTGCCATTGTTTTTG,AATTCAAAAACAATGGCACAATCTTGGCTCACTCGAGTGAGCCAAGATTGTGCCATTG,n/a
human,102723347,LOC102723347,XR_001756162.2,TRCN0000163887,NM_007261.1-867s1c1,CCCAGGGAAGAACTTCACTAT,pLKO.1,104,3UTR,80,89,,,Y,11314,CD300A,CCGGCCCAGGGAAGAACTTCACTATCTCGAGATAGTGAAGTTCTTCCCTGGGTTTTTG,AATTCAAAAACCCAGGGAAGAACTTCACTATCTCGAGATAGTGAAGTTCTTCCCTGGG,n/a
human,102723347,LOC102723347,XR_001756162.2,TRCN0000128966,NM_145055.1-83s1c1,GAAGAACTCATTGAGTCCGAA,pLKO.1,110,3UTR,80,89,,,Y,147339,C18orf25,CCGGGAAGAACTCATTGAGTCCGAACTCGAGTTCGGACTCAATGAGTTCTTCTTTTTG,AATTCAAAAAGAAGAACTCATTGAGTCCGAACTCGAGTTCGGACTCAATGAGTTCTTC,n/a
human,102723347,LOC102723347,XR_001756162.2,TRCN0000140039,NM_017539.1-283s1c1,GCACCCTTCAAAGAACAGCAT,pLKO.1,232,3UTR,80,89,,,Y,55567,DNAH3,CCGGGCACCCTTCAAAGAACAGCATCTCGAGATGCTGTTCTTTGAAGGGTGCTTTTTG,AATTCAAAAAGCACCCTTCAAAGAACAGCATCTCGAGATGCTGTTCTTTGAAGGGTGC,n/a
human,102723347,LOC102723347,XR_001756162.2,TRCN0000378991,NM_003182.2-602s21c1,GGAGTGCAATGCAGAATTATG,pLKO_005,389,3UTR,81,85,,,Y,6863,TAC1,CCGGGGAGTGCAATGCAGAATTATGCTCGAGCATAATTCTGCATTGCACTCCTTTTTG,AATTCAAAAAGGAGTGCAATGCAGAATTATGCTCGAGCATAATTCTGCATTGCACTCC,n/a
