Taxon,"Gene ID","Gene Symbol",Transcript,"Clone ID","Legacy Clone Name","Target Seq",Vector,"Match Position","Match Region","Match %","SDR Match %","Intrinsic Score","Adjusted Score","Matches Other Gene in Same Taxon?","Orig. Target Gene ID","Orig. Target Gene Symbol","Forward Oligo Sequence","Reverse Oligo Sequence",Addgene
human,102723347,LOC102723347,XR_001756164.1,TRCN0000159185,NM_001033515.1-103s1c1,GAGCAACAAGAAACGAATAAA,pLKO.1,334,3UTR,100,100,15,7.5,Y,100132288,TEKT4P2,CCGGGAGCAACAAGAAACGAATAAACTCGAGTTTATTCGTTTCTTGTTGCTCTTTTTG,AATTCAAAAAGAGCAACAAGAAACGAATAAACTCGAGTTTATTCGTTTCTTGTTGCTC,n/a
human,102723347,LOC102723347,XR_001756164.1,TRCN0000159736,NM_001033515.1-105s1c1,GCAACAAGAAACGAATAAATC,pLKO.1,336,3UTR,100,100,13.2,6.6,Y,100132288,TEKT4P2,CCGGGCAACAAGAAACGAATAAATCCTCGAGGATTTATTCGTTTCTTGTTGCTTTTTG,AATTCAAAAAGCAACAAGAAACGAATAAATCCTCGAGGATTTATTCGTTTCTTGTTGC,n/a
human,102723347,LOC102723347,XR_001756164.1,TRCN0000161734,NM_001033515.1-99s1c1,CCAAGAGCAACAAGAAACGAA,pLKO.1,330,3UTR,100,100,3,1.5,Y,100132288,TEKT4P2,CCGGCCAAGAGCAACAAGAAACGAACTCGAGTTCGTTTCTTGTTGCTCTTGGTTTTTG,AATTCAAAAACCAAGAGCAACAAGAAACGAACTCGAGTTCGTTTCTTGTTGCTCTTGG,n/a
human,102723347,LOC102723347,XR_001756164.1,TRCN0000033647,NM_206595.1-956s1c1,CCTCACTACACTGTGTGACTT,pLKO.1,35,3UTR,85,89,,,Y,2104,ESRRG,CCGGCCTCACTACACTGTGTGACTTCTCGAGAAGTCACACAGTGTAGTGAGGTTTTTG,AATTCAAAAACCTCACTACACTGTGTGACTTCTCGAGAAGTCACACAGTGTAGTGAGG,n/a
human,102723347,LOC102723347,XR_001756164.1,TRCN0000163887,NM_007261.1-867s1c1,CCCAGGGAAGAACTTCACTAT,pLKO.1,104,3UTR,80,89,,,Y,11314,CD300A,CCGGCCCAGGGAAGAACTTCACTATCTCGAGATAGTGAAGTTCTTCCCTGGGTTTTTG,AATTCAAAAACCCAGGGAAGAACTTCACTATCTCGAGATAGTGAAGTTCTTCCCTGGG,n/a
human,102723347,LOC102723347,XR_001756164.1,TRCN0000128966,NM_145055.1-83s1c1,GAAGAACTCATTGAGTCCGAA,pLKO.1,110,3UTR,80,89,,,Y,147339,C18orf25,CCGGGAAGAACTCATTGAGTCCGAACTCGAGTTCGGACTCAATGAGTTCTTCTTTTTG,AATTCAAAAAGAAGAACTCATTGAGTCCGAACTCGAGTTCGGACTCAATGAGTTCTTC,n/a
human,102723347,LOC102723347,XR_001756164.1,TRCN0000140039,NM_017539.1-283s1c1,GCACCCTTCAAAGAACAGCAT,pLKO.1,232,3UTR,80,89,,,Y,55567,DNAH3,CCGGGCACCCTTCAAAGAACAGCATCTCGAGATGCTGTTCTTTGAAGGGTGCTTTTTG,AATTCAAAAAGCACCCTTCAAAGAACAGCATCTCGAGATGCTGTTCTTTGAAGGGTGC,n/a
human,102723347,LOC102723347,XR_001756164.1,TRCN0000182336,NM_027560.1-1904s1c1,GCAGACAAGCACAGAGGAAAT,pLKO.1,377,3UTR,86,85,,,Y,70807,Arrdc2,CCGGGCAGACAAGCACAGAGGAAATCTCGAGATTTCCTCTGTGCTTGTCTGCTTTTTG,AATTCAAAAAGCAGACAAGCACAGAGGAAATCTCGAGATTTCCTCTGTGCTTGTCTGC,n/a
