Taxon,"Gene ID","Gene Symbol",Transcript,"Clone ID","Legacy Clone Name","Target Seq",Vector,"Match Position","Match Region","Match %","SDR Match %","Intrinsic Score","Adjusted Score","Matches Other Gene in Same Taxon?","Orig. Target Gene ID","Orig. Target Gene Symbol","Forward Oligo Sequence","Reverse Oligo Sequence",Addgene
human,7404,UTY,XR_002958831.1,TRCN0000108119,NM_007125.3-4225s1c1,CTGGGCATGAATACAGTACAA,pLKO.1,2958,3UTR,100,100,4.95,6.93,N,7404,UTY,CCGGCTGGGCATGAATACAGTACAACTCGAGTTGTACTGTATTCATGCCCAGTTTTTG,AATTCAAAAACTGGGCATGAATACAGTACAACTCGAGTTGTACTGTATTCATGCCCAG,n/a
human,7404,UTY,XR_002958831.1,TRCN0000108116,NM_007125.3-2298s1c1,GCGAGCAAATAGAGATAATTT,pLKO.1,1804,3UTR,100,100,15,12,N,7404,UTY,CCGGGCGAGCAAATAGAGATAATTTCTCGAGAAATTATCTCTATTTGCTCGCTTTTTG,AATTCAAAAAGCGAGCAAATAGAGATAATTTCTCGAGAAATTATCTCTATTTGCTCGC,n/a
human,7404,UTY,XR_002958831.1,TRCN0000108117,NM_007125.3-2633s1c1,GCAGTAATTGTATAGCAGGAA,pLKO.1,2139,3UTR,100,100,2.64,1.848,N,7404,UTY,CCGGGCAGTAATTGTATAGCAGGAACTCGAGTTCCTGCTATACAATTACTGCTTTTTG,AATTCAAAAAGCAGTAATTGTATAGCAGGAACTCGAGTTCCTGCTATACAATTACTGC,n/a
human,7404,UTY,XR_002958831.1,TRCN0000218022,NM_007125.3-2001s21c1,GGATGCTTTACAGGCATATAT,pLKO_005,1351,3UTR,100,100,15,9,N,7404,UTY,CCGGGGATGCTTTACAGGCATATATCTCGAGATATATGCCTGTAAAGCATCCTTTTTG,AATTCAAAAAGGATGCTTTACAGGCATATATCTCGAGATATATGCCTGTAAAGCATCC,n/a
human,7404,UTY,XR_002958831.1,TRCN0000229956,NM_007125.3-3657s21c1,TCCACCCACACCTAGTATTTA,pLKO_005,2390,3UTR,100,100,15,9,N,7404,UTY,CCGGTCCACCCACACCTAGTATTTACTCGAGTAAATACTAGGTGTGGGTGGATTTTTG,AATTCAAAAATCCACCCACACCTAGTATTTACTCGAGTAAATACTAGGTGTGGGTGGA,n/a
human,7404,UTY,XR_002958831.1,TRCN0000096242,NM_009483.1-581s1c1,GCTACGAATCTCTAATCTTAA,pLKO.1,582,3UTR,95,95,,,Y,22289,Kdm6a,CCGGGCTACGAATCTCTAATCTTAACTCGAGTTAAGATTAGAGATTCGTAGCTTTTTG,AATTCAAAAAGCTACGAATCTCTAATCTTAACTCGAGTTAAGATTAGAGATTCGTAGC,n/a
human,7404,UTY,XR_002958831.1,TRCN0000331919,NM_009483.1-581s21c1,GCTACGAATCTCTAATCTTAA,pLKO_005,582,3UTR,95,95,,,Y,22289,Kdm6a,CCGGGCTACGAATCTCTAATCTTAACTCGAGTTAAGATTAGAGATTCGTAGCTTTTTG,AATTCAAAAAGCTACGAATCTCTAATCTTAACTCGAGTTAAGATTAGAGATTCGTAGC,n/a
human,7404,UTY,XR_002958831.1,TRCN0000095070,NM_009484.1-809s1c1,GCACCATAATATGGATCTAAT,pLKO.1,1102,3UTR,90,95,,,N,22290,Uty,CCGGGCACCATAATATGGATCTAATCTCGAGATTAGATCCATATTATGGTGCTTTTTG,AATTCAAAAAGCACCATAATATGGATCTAATCTCGAGATTAGATCCATATTATGGTGC,n/a
human,7404,UTY,XR_002958831.1,TRCN0000095071,NM_009484.1-1113s1c1,GCCTGGATGGACTTAGGTATT,pLKO.1,1406,3UTR,90,95,,,N,22290,Uty,CCGGGCCTGGATGGACTTAGGTATTCTCGAGAATACCTAAGTCCATCCAGGCTTTTTG,AATTCAAAAAGCCTGGATGGACTTAGGTATTCTCGAGAATACCTAAGTCCATCCAGGC,n/a
human,7404,UTY,XR_002958831.1,TRCN0000095073,NM_009484.1-808s1c1,TGCACCATAATATGGATCTAA,pLKO.1,1101,3UTR,90,95,,,N,22290,Uty,CCGGTGCACCATAATATGGATCTAACTCGAGTTAGATCCATATTATGGTGCATTTTTG,AATTCAAAAATGCACCATAATATGGATCTAACTCGAGTTAGATCCATATTATGGTGCA,n/a
human,7404,UTY,XR_002958831.1,TRCN0000242894,NM_152499.1-235s21c1,CGCGAAGTGAAGAGGATTCTG,pLKO_005,440,3UTR,90,90,,,Y,149473,CCDC24,CCGGCGCGAAGTGAAGAGGATTCTGCTCGAGCAGAATCCTCTTCACTTCGCGTTTTTG,AATTCAAAAACGCGAAGTGAAGAGGATTCTGCTCGAGCAGAATCCTCTTCACTTCGCG,n/a
human,7404,UTY,XR_002958831.1,TRCN0000162624,NM_020317.3-978s1c1,CCAGCAAAGAAGCATAGCTTT,pLKO.1,1829,3UTR,81,90,,,Y,57035,RSRP1,CCGGCCAGCAAAGAAGCATAGCTTTCTCGAGAAAGCTATGCTTCTTTGCTGGTTTTTG,AATTCAAAAACCAGCAAAGAAGCATAGCTTTCTCGAGAAAGCTATGCTTCTTTGCTGG,n/a
human,7404,UTY,XR_002958831.1,TRCN0000305301,NM_009483.1-778s21c1,GCATTTCAGTGGGCTATTAAA,pLKO_005,779,3UTR,90,89,,,Y,22289,Kdm6a,CCGGGCATTTCAGTGGGCTATTAAACTCGAGTTTAATAGCCCACTGAAATGCTTTTTG,AATTCAAAAAGCATTTCAGTGGGCTATTAAACTCGAGTTTAATAGCCCACTGAAATGC,n/a
human,7404,UTY,XR_002958831.1,TRCN0000296309,NM_000950.2-1244s21c1,CCATTAACTTCTACCTAAATC,pLKO_005,1458,3UTR,85,89,,,Y,5638,PRRG1,CCGGCCATTAACTTCTACCTAAATCCTCGAGGATTTAGGTAGAAGTTAATGGTTTTTG,AATTCAAAAACCATTAACTTCTACCTAAATCCTCGAGGATTTAGGTAGAAGTTAATGG,n/a
human,7404,UTY,XR_002958831.1,TRCN0000107764,NM_021140.1-3409s1c1,GCATGAACACAGTTCAACTAT,pLKO.1,2962,3UTR,85,89,,,Y,7403,KDM6A,CCGGGCATGAACACAGTTCAACTATCTCGAGATAGTTGAACTGTGTTCATGCTTTTTG,AATTCAAAAAGCATGAACACAGTTCAACTATCTCGAGATAGTTGAACTGTGTTCATGC,n/a
human,7404,UTY,XR_002958831.1,TRCN0000003487,NM_000063.x-2208s1c1,GCCACGAGACTTTCACATCAA,pLKO.1,1722,3UTR,85,89,,,Y,717,C2,CCGGGCCACGAGACTTTCACATCAACTCGAGTTGATGTGAAAGTCTCGTGGCTTTTTG,AATTCAAAAAGCCACGAGACTTTCACATCAACTCGAGTTGATGTGAAAGTCTCGTGGC,n/a
human,7404,UTY,XR_002958831.1,TRCN0000110899,NM_011166.1-355s1c1,GCCGGGTGTATTCCTTGTGAA,pLKO.1,2078,3UTR,80,89,,,N,19111,Prl6a1,CCGGGCCGGGTGTATTCCTTGTGAACTCGAGTTCACAAGGAATACACCCGGCTTTTTG,AATTCAAAAAGCCGGGTGTATTCCTTGTGAACTCGAGTTCACAAGGAATACACCCGGC,n/a
human,7404,UTY,XR_002958831.1,TRCN0000167480,NM_153687.1-550s1c1,GCCTAGAAGAAATGAACATTA,pLKO.1,1664,3UTR,80,89,,,Y,121457,IKBIP,CCGGGCCTAGAAGAAATGAACATTACTCGAGTAATGTTCATTTCTTCTAGGCTTTTTG,AATTCAAAAAGCCTAGAAGAAATGAACATTACTCGAGTAATGTTCATTTCTTCTAGGC,n/a
human,7404,UTY,XR_002958831.1,TRCN0000218066,XM_001006405.1-986s21c1,ATGGTCTACTTCAACTACATG,pLKO_005,758,3UTR,80,89,,,Y,545793,AB010352,CCGGATGGTCTACTTCAACTACATGCTCGAGCATGTAGTTGAAGTAGACCATTTTTTG,AATTCAAAAAATGGTCTACTTCAACTACATGCTCGAGCATGTAGTTGAAGTAGACCAT,n/a
human,7404,UTY,XR_002958831.1,TRCN0000142424,NM_015077.1-1770s1c1,GCAACTTTGTGTTGGTGCTAT,pLKO.1,69,3UTR,80,89,,,Y,23098,SARM1,CCGGGCAACTTTGTGTTGGTGCTATCTCGAGATAGCACCAACACAAAGTTGCTTTTTG,AATTCAAAAAGCAACTTTGTGTTGGTGCTATCTCGAGATAGCACCAACACAAAGTTGC,n/a
human,7404,UTY,XR_002958831.1,TRCN0000158930,NM_003007.2-1330s1c1,GTAATTATAGAGCAGGAAGAT,pLKO.1,2142,3UTR,80,89,,,Y,6406,SEMG1,CCGGGTAATTATAGAGCAGGAAGATCTCGAGATCTTCCTGCTCTATAATTACTTTTTG,AATTCAAAAAGTAATTATAGAGCAGGAAGATCTCGAGATCTTCCTGCTCTATAATTAC,n/a
human,7404,UTY,XR_002958831.1,TRCN0000161599,NM_207385.1-227s1c1,GCTGAGACACAAAGAAGTTAA,pLKO.1,1885,3UTR,80,89,,,Y,,,CCGGGCTGAGACACAAAGAAGTTAACTCGAGTTAACTTCTTTGTGTCTCAGCTTTTTG,AATTCAAAAAGCTGAGACACAAAGAAGTTAACTCGAGTTAACTTCTTTGTGTCTCAGC,n/a
human,7404,UTY,XR_002958831.1,TRCN0000001680,NM_009915.x-684s1c1,CCTCTCTACCAGGAATCATAT,pLKO.1,2701,3UTR,80,89,,,Y,12772,Ccr2,CCGGCCTCTCTACCAGGAATCATATCTCGAGATATGATTCCTGGTAGAGAGGTTTTTG,AATTCAAAAACCTCTCTACCAGGAATCATATCTCGAGATATGATTCCTGGTAGAGAGG,n/a
human,7404,UTY,XR_002958831.1,TRCN0000313278,NM_133710.3-411s21c1,CAGCGCAACATCAGCCTAAAG,pLKO_005,1331,3UTR,81,85,,,N,69274,Ctdspl,CCGGCAGCGCAACATCAGCCTAAAGCTCGAGCTTTAGGCTGATGTTGCGCTGTTTTTG,AATTCAAAAACAGCGCAACATCAGCCTAAAGCTCGAGCTTTAGGCTGATGTTGCGCTG,n/a
human,7404,UTY,XR_002958831.1,TRCN0000245860,NM_001080441.1-132s21c1,TCAAGCACAGCTGGAACAGTC,pLKO_005,1836,3UTR,81,85,,,Y,143941,TTC36,CCGGTCAAGCACAGCTGGAACAGTCCTCGAGGACTGTTCCAGCTGTGCTTGATTTTTG,AATTCAAAAATCAAGCACAGCTGGAACAGTCCTCGAGGACTGTTCCAGCTGTGCTTGA,n/a
human,7404,UTY,XR_002958831.1,TRCN0000019924,NM_013450.1-5422s1c1,CGGAACATTGAAAGAAGAATT,pLKO.1,2710,3UTR,77,85,,,Y,29994,BAZ2B,CCGGCGGAACATTGAAAGAAGAATTCTCGAGAATTCTTCTTTCAATGTTCCGTTTTTG,AATTCAAAAACGGAACATTGAAAGAAGAATTCTCGAGAATTCTTCTTTCAATGTTCCG,n/a
human,7404,UTY,XR_002958831.1,TRCN0000125468,NM_133710.1-492s1c1,CCAGCGCAACATCAGCCTAAA,pLKO.1,1330,3UTR,77,85,,,Y,69274,Ctdspl,CCGGCCAGCGCAACATCAGCCTAAACTCGAGTTTAGGCTGATGTTGCGCTGGTTTTTG,AATTCAAAAACCAGCGCAACATCAGCCTAAACTCGAGTTTAGGCTGATGTTGCGCTGG,n/a
