Taxon,"Gene ID","Gene Symbol",Transcript,"Clone ID","Legacy Clone Name","Target Seq",Vector,"Match Position","Match Region","Match %","SDR Match %","Intrinsic Score","Adjusted Score","Matches Other Gene in Same Taxon?","Orig. Target Gene ID","Orig. Target Gene Symbol","Forward Oligo Sequence","Reverse Oligo Sequence",Addgene
mouse,100861673,Gm21123,XR_140838.1,TRCN0000435125,NM_152536.3-3252s21c1,GTGCTCCTCACAGACTATTTA,pLKO_005,1690,3UTR,86,90,,,N,152273,FGD5,CCGGGTGCTCCTCACAGACTATTTACTCGAGTAAATAGTCTGTGAGGAGCACTTTTTG,AATTCAAAAAGTGCTCCTCACAGACTATTTACTCGAGTAAATAGTCTGTGAGGAGCAC,n/a
mouse,100861673,Gm21123,XR_140838.1,TRCN0000313280,NM_026384.3-756s21c1,TCCTGGCATAAGGCCCTATTT,pLKO_005,1670,3UTR,86,90,,,Y,67800,Dgat2,CCGGTCCTGGCATAAGGCCCTATTTCTCGAGAAATAGGGCCTTATGCCAGGATTTTTG,AATTCAAAAATCCTGGCATAAGGCCCTATTTCTCGAGAAATAGGGCCTTATGCCAGGA,n/a
mouse,100861673,Gm21123,XR_140838.1,TRCN0000443235,NM_009287.4-909s21c1,CACCTTCCATGGTGAGGATAA,pLKO_005,1188,3UTR,86,90,,,Y,20866,Stim1,CCGGCACCTTCCATGGTGAGGATAACTCGAGTTATCCTCACCATGGAAGGTGTTTTTG,AATTCAAAAACACCTTCCATGGTGAGGATAACTCGAGTTATCCTCACCATGGAAGGTG,n/a
mouse,100861673,Gm21123,XR_140838.1,TRCN0000382313,NM_020783.3-536s21c1,TGCTTAAGGGAGTTGATATTT,pLKO_005,211,3UTR,90,89,,,Y,6860,SYT4,CCGGTGCTTAAGGGAGTTGATATTTCTCGAGAAATATCAACTCCCTTAAGCATTTTTG,AATTCAAAAATGCTTAAGGGAGTTGATATTTCTCGAGAAATATCAACTCCCTTAAGCA,n/a
mouse,100861673,Gm21123,XR_140838.1,TRCN0000155224,NM_006348.2-1117s1c1,GCCAAGAAGAGAGATCCTGTT,pLKO.1,853,3UTR,85,89,,,Y,10466,COG5,CCGGGCCAAGAAGAGAGATCCTGTTCTCGAGAACAGGATCTCTCTTCTTGGCTTTTTG,AATTCAAAAAGCCAAGAAGAGAGATCCTGTTCTCGAGAACAGGATCTCTCTTCTTGGC,n/a
mouse,100861673,Gm21123,XR_140838.1,TRCN0000583836,,CATATTGTTCACCTCATTATG,pLKO_005,235,3UTR,85,89,,,Y,282763,OR51B5,CCGGCATATTGTTCACCTCATTATGCTCGAGCATAATGAGGTGAACAATATGTTTTTG,AATTCAAAAACATATTGTTCACCTCATTATGCTCGAGCATAATGAGGTGAACAATATG,n/a
mouse,100861673,Gm21123,XR_140838.1,TRCN0000431092,NM_194320.2-1725s21c1,GCCCTGCATTTGCGATGAATG,pLKO_005,746,3UTR,80,89,,,N,169841,ZNF169,CCGGGCCCTGCATTTGCGATGAATGCTCGAGCATTCATCGCAAATGCAGGGCTTTTTG,AATTCAAAAAGCCCTGCATTTGCGATGAATGCTCGAGCATTCATCGCAAATGCAGGGC,n/a
mouse,100861673,Gm21123,XR_140838.1,TRCN0000135283,NM_024902.2-695s1c1,CCTTTCTTCCATGGTCAACTT,pLKO.1,597,3UTR,80,89,,,Y,79962,DNAJC22,CCGGCCTTTCTTCCATGGTCAACTTCTCGAGAAGTTGACCATGGAAGAAAGGTTTTTG,AATTCAAAAACCTTTCTTCCATGGTCAACTTCTCGAGAAGTTGACCATGGAAGAAAGG,n/a
mouse,100861673,Gm21123,XR_140838.1,TRCN0000036163,XM_208554.3-316s1c1,CGAGTAATAGTGGAATGGCTA,pLKO.1,318,3UTR,86,85,,,Y,283226,FNTAP1,CCGGCGAGTAATAGTGGAATGGCTACTCGAGTAGCCATTCCACTATTACTCGTTTTTG,AATTCAAAAACGAGTAATAGTGGAATGGCTACTCGAGTAGCCATTCCACTATTACTCG,n/a
mouse,100861673,Gm21123,XR_140838.1,TRCN0000270577,NM_001034904.1-469s21c1,CTGAAGGCCTGCTACTCAATT,pLKO_005,1398,3UTR,81,85,,,Y,545929,Gm5891,CCGGCTGAAGGCCTGCTACTCAATTCTCGAGAATTGAGTAGCAGGCCTTCAGTTTTTG,AATTCAAAAACTGAAGGCCTGCTACTCAATTCTCGAGAATTGAGTAGCAGGCCTTCAG,n/a
mouse,100861673,Gm21123,XR_140838.1,TRCN0000337594,NM_011925.2-2643s21c1,ATGAAGGACAGCAGCACATAC,pLKO_005,468,3UTR,77,85,,,Y,26364,Adgre5,CCGGATGAAGGACAGCAGCACATACCTCGAGGTATGTGCTGCTGTCCTTCATTTTTTG,AATTCAAAAAATGAAGGACAGCAGCACATACCTCGAGGTATGTGCTGCTGTCCTTCAT,n/a
