Taxon,"Gene ID","Gene Symbol",Transcript,"Clone ID","Legacy Clone Name","Target Seq",Vector,"Match Position","Match Region","Match %","SDR Match %","Intrinsic Score","Adjusted Score","Matches Other Gene in Same Taxon?","Orig. Target Gene ID","Orig. Target Gene Symbol","Forward Oligo Sequence","Reverse Oligo Sequence",Addgene
mouse,102636202,Gm33337,XR_872084.1,TRCN0000446981,NM_031209.2-281s21c1,ATCCAGAAAGCCAACGGTCTC,pLKO_005,1336,3UTR,90,90,,,N,81890,QTRT1,CCGGATCCAGAAAGCCAACGGTCTCCTCGAGGAGACCGTTGGCTTTCTGGATTTTTTG,AATTCAAAAAATCCAGAAAGCCAACGGTCTCCTCGAGGAGACCGTTGGCTTTCTGGAT,n/a
mouse,102636202,Gm33337,XR_872084.1,TRCN0000375400,NM_170777.3-488s21c1,CCAATCAGTAGCAAAGTCAGG,pLKO_005,1458,3UTR,81,90,,,Y,66126,Elof1,CCGGCCAATCAGTAGCAAAGTCAGGCTCGAGCCTGACTTTGCTACTGATTGGTTTTTG,AATTCAAAAACCAATCAGTAGCAAAGTCAGGCTCGAGCCTGACTTTGCTACTGATTGG,n/a
mouse,102636202,Gm33337,XR_872084.1,TRCN0000071922,NM_153131.1-2731s1c1,CGAACTCTAGCCCAGAAACTT,pLKO.1,1687,3UTR,85,89,,,Y,107448,Unc5a,CCGGCGAACTCTAGCCCAGAAACTTCTCGAGAAGTTTCTGGGCTAGAGTTCGTTTTTG,AATTCAAAAACGAACTCTAGCCCAGAAACTTCTCGAGAAGTTTCTGGGCTAGAGTTCG,n/a
mouse,102636202,Gm33337,XR_872084.1,TRCN0000108260,NM_178012.3-1691s1c1,GTCCTCTCTTTCTCTTCCTTT,pLKO.1,1918,3UTR,85,89,,,Y,347733,TUBB2B,CCGGGTCCTCTCTTTCTCTTCCTTTCTCGAGAAAGGAAGAGAAAGAGAGGACTTTTTG,AATTCAAAAAGTCCTCTCTTTCTCTTCCTTTCTCGAGAAAGGAAGAGAAAGAGAGGAC,n/a
mouse,102636202,Gm33337,XR_872084.1,TRCN0000168112,NM_194278.2-3866s1c1,CCAGAATCAGGAGAACACTTT,pLKO.1,1745,3UTR,85,89,,,Y,91748,ELMSAN1,CCGGCCAGAATCAGGAGAACACTTTCTCGAGAAAGTGTTCTCCTGATTCTGGTTTTTG,AATTCAAAAACCAGAATCAGGAGAACACTTTCTCGAGAAAGTGTTCTCCTGATTCTGG,n/a
mouse,102636202,Gm33337,XR_872084.1,TRCN0000165445,NM_005096.2-4583s1c1,GCATAGGTAGAGCCTCTTGTT,pLKO.1,597,3UTR,85,89,,,Y,9203,ZMYM3,CCGGGCATAGGTAGAGCCTCTTGTTCTCGAGAACAAGAGGCTCTACCTATGCTTTTTG,AATTCAAAAAGCATAGGTAGAGCCTCTTGTTCTCGAGAACAAGAGGCTCTACCTATGC,n/a
mouse,102636202,Gm33337,XR_872084.1,TRCN0000239858,XM_912516.3-439s21c1,GTAGTAGCCTTTCAGATATAT,pLKO_005,2020,3UTR,80,89,,,N,,,CCGGGTAGTAGCCTTTCAGATATATCTCGAGATATATCTGAAAGGCTACTACTTTTTG,AATTCAAAAAGTAGTAGCCTTTCAGATATATCTCGAGATATATCTGAAAGGCTACTAC,n/a
mouse,102636202,Gm33337,XR_872084.1,TRCN0000423084,NM_011122.3-1635s21c1,CCAGACCACCCACCTACATAA,pLKO_005,1871,3UTR,80,89,,,Y,18822,Plod1,CCGGCCAGACCACCCACCTACATAACTCGAGTTATGTAGGTGGGTGGTCTGGTTTTTG,AATTCAAAAACCAGACCACCCACCTACATAACTCGAGTTATGTAGGTGGGTGGTCTGG,n/a
mouse,102636202,Gm33337,XR_872084.1,TRCN0000248161,NM_139306.1-663s21c1,TGCACTGTGTGTGGCATATTC,pLKO_005,2038,3UTR,80,89,,,Y,230379,Acer2,CCGGTGCACTGTGTGTGGCATATTCCTCGAGGAATATGCCACACACAGTGCATTTTTG,AATTCAAAAATGCACTGTGTGTGGCATATTCCTCGAGGAATATGCCACACACAGTGCA,n/a
mouse,102636202,Gm33337,XR_872084.1,TRCN0000234007,NM_013871.2-1533s21c1,TTCTGGAGTTGTACATGAAAT,pLKO_005,440,3UTR,80,89,,,Y,29857,Mapk12,CCGGTTCTGGAGTTGTACATGAAATCTCGAGATTTCATGTACAACTCCAGAATTTTTG,AATTCAAAAATTCTGGAGTTGTACATGAAATCTCGAGATTTCATGTACAACTCCAGAA,n/a
mouse,102636202,Gm33337,XR_872084.1,TRCN0000249420,NM_025947.2-125s21c1,ATTCCCATCAAGAGCACAATG,pLKO_005,171,3UTR,80,89,,,Y,67068,Dynlrb1,CCGGATTCCCATCAAGAGCACAATGCTCGAGCATTGTGCTCTTGATGGGAATTTTTTG,AATTCAAAAAATTCCCATCAAGAGCACAATGCTCGAGCATTGTGCTCTTGATGGGAAT,n/a
mouse,102636202,Gm33337,XR_872084.1,TRCN0000249088,NM_176831.4-632s21c1,CCTTTGGCTACGTGGAGATTC,pLKO_005,460,3UTR,80,89,,,Y,66812,Ppcdc,CCGGCCTTTGGCTACGTGGAGATTCCTCGAGGAATCTCCACGTAGCCAAAGGTTTTTG,AATTCAAAAACCTTTGGCTACGTGGAGATTCCTCGAGGAATCTCCACGTAGCCAAAGG,n/a
mouse,102636202,Gm33337,XR_872084.1,TRCN0000432613,NM_198998.1-547s21c1,TGTTTCCATCTGACCCTCCTG,pLKO_005,1239,3UTR,80,89,,,Y,375318,AQP12A,CCGGTGTTTCCATCTGACCCTCCTGCTCGAGCAGGAGGGTCAGATGGAAACATTTTTG,AATTCAAAAATGTTTCCATCTGACCCTCCTGCTCGAGCAGGAGGGTCAGATGGAAACA,n/a
mouse,102636202,Gm33337,XR_872084.1,TRCN0000174377,NM_134054.1-508s1c1,CCTTTGTGACTGTTTCAATAT,pLKO.1,1229,3UTR,80,89,,,Y,104725,Sptssa,CCGGCCTTTGTGACTGTTTCAATATCTCGAGATATTGAAACAGTCACAAAGGTTTTTG,AATTCAAAAACCTTTGTGACTGTTTCAATATCTCGAGATATTGAAACAGTCACAAAGG,n/a
mouse,102636202,Gm33337,XR_872084.1,TRCN0000320029,NM_134054.2-582s21c1,CCTTTGTGACTGTTTCAATAT,pLKO_005,1229,3UTR,80,89,,,Y,104725,Sptssa,CCGGCCTTTGTGACTGTTTCAATATCTCGAGATATTGAAACAGTCACAAAGGTTTTTG,AATTCAAAAACCTTTGTGACTGTTTCAATATCTCGAGATATTGAAACAGTCACAAAGG,n/a
mouse,102636202,Gm33337,XR_872084.1,TRCN0000167545,NM_001012707.1-1186s1c1,GCTCTGGATCTTGAAACAAAT,pLKO.1,720,3UTR,80,89,,,Y,378826,C21orf114,CCGGGCTCTGGATCTTGAAACAAATCTCGAGATTTGTTTCAAGATCCAGAGCTTTTTG,AATTCAAAAAGCTCTGGATCTTGAAACAAATCTCGAGATTTGTTTCAAGATCCAGAGC,n/a
mouse,102636202,Gm33337,XR_872084.1,TRCN0000420663,NM_015178.2-3152s21c1,ACGGACTTGAGTGTTGCATTT,pLKO_005,1542,3UTR,81,85,,,N,23221,RHOBTB2,CCGGACGGACTTGAGTGTTGCATTTCTCGAGAAATGCAACACTCAAGTCCGTTTTTTG,AATTCAAAAAACGGACTTGAGTGTTGCATTTCTCGAGAAATGCAACACTCAAGTCCGT,n/a
mouse,102636202,Gm33337,XR_872084.1,TRCN0000190468,NM_026731.2-271s1c1,GAAGAGGAAAGATGCCGGAAA,pLKO.1,179,3UTR,81,85,,,Y,68458,Ppp1r14a,CCGGGAAGAGGAAAGATGCCGGAAACTCGAGTTTCCGGCATCTTTCCTCTTCTTTTTG,AATTCAAAAAGAAGAGGAAAGATGCCGGAAACTCGAGTTTCCGGCATCTTTCCTCTTC,n/a
mouse,102636202,Gm33337,XR_872084.1,TRCN0000015526,XM_210048.3-87s1c1,CGTCACTCTCTGTTCTTGCTA,pLKO.1,675,3UTR,77,85,,,Y,286436,H2BW2,CCGGCGTCACTCTCTGTTCTTGCTACTCGAGTAGCAAGAACAGAGAGTGACGTTTTTG,AATTCAAAAACGTCACTCTCTGTTCTTGCTACTCGAGTAGCAAGAACAGAGAGTGACG,n/a
