Taxon,"Gene ID","Gene Symbol",Transcript,"Clone ID","Legacy Clone Name","Target Seq",Vector,"Match Position","Match Region","Match %","SDR Match %","Intrinsic Score","Adjusted Score","Matches Other Gene in Same Taxon?","Orig. Target Gene ID","Orig. Target Gene Symbol","Forward Oligo Sequence","Reverse Oligo Sequence",Addgene
human,51275,MAPKAPK5-AS1,NR_152608.1,TRCN0000163149,NM_016534.2-1145s1c1,GCATTAACCTTACGTGGAGTT,pLKO.1,173,3UTR,100,100,4.05,5.67,N,51275,MAPKAPK5-AS1,CCGGGCATTAACCTTACGTGGAGTTCTCGAGAACTCCACGTAAGGTTAATGCTTTTTG,AATTCAAAAAGCATTAACCTTACGTGGAGTTCTCGAGAACTCCACGTAAGGTTAATGC,n/a
human,51275,MAPKAPK5-AS1,NR_152608.1,TRCN0000166460,NM_016534.2-1187s1c1,CGTCTTTACAAGGTAGCCGTT,pLKO.1,215,3UTR,100,100,2.16,3.024,N,51275,MAPKAPK5-AS1,CCGGCGTCTTTACAAGGTAGCCGTTCTCGAGAACGGCTACCTTGTAAAGACGTTTTTG,AATTCAAAAACGTCTTTACAAGGTAGCCGTTCTCGAGAACGGCTACCTTGTAAAGACG,n/a
human,51275,MAPKAPK5-AS1,NR_152608.1,TRCN0000161267,NM_016534.2-1158s1c1,GTGGAGTTATTTCCTGCATTT,pLKO.1,186,3UTR,100,100,10.8,7.56,N,51275,MAPKAPK5-AS1,CCGGGTGGAGTTATTTCCTGCATTTCTCGAGAAATGCAGGAAATAACTCCACTTTTTG,AATTCAAAAAGTGGAGTTATTTCCTGCATTTCTCGAGAAATGCAGGAAATAACTCCAC,n/a
human,51275,MAPKAPK5-AS1,NR_152608.1,TRCN0000163395,NM_016534.2-1826s1c1,GATGCCATTGAGTGAGTGAAA,pLKO.1,497,3UTR,100,100,4.95,3.465,N,51275,MAPKAPK5-AS1,CCGGGATGCCATTGAGTGAGTGAAACTCGAGTTTCACTCACTCAATGGCATCTTTTTG,AATTCAAAAAGATGCCATTGAGTGAGTGAAACTCGAGTTTCACTCACTCAATGGCATC,n/a
human,51275,MAPKAPK5-AS1,NR_152608.1,TRCN0000164378,NM_016534.2-1740s1c1,CCTGAAGGATTAGATGTGGAA,pLKO.1,411,3UTR,100,100,2.64,1.848,N,51275,MAPKAPK5-AS1,CCGGCCTGAAGGATTAGATGTGGAACTCGAGTTCCACATCTAATCCTTCAGGTTTTTG,AATTCAAAAACCTGAAGGATTAGATGTGGAACTCGAGTTCCACATCTAATCCTTCAGG,n/a
human,51275,MAPKAPK5-AS1,NR_152608.1,TRCN0000164801,NM_016534.2-1646s1c1,CCTCCCAAAGTACTGGGATTA,pLKO.1,317,3UTR,100,100,1.08,.54,Y,51275,MAPKAPK5-AS1,CCGGCCTCCCAAAGTACTGGGATTACTCGAGTAATCCCAGTACTTTGGGAGGTTTTTG,AATTCAAAAACCTCCCAAAGTACTGGGATTACTCGAGTAATCCCAGTACTTTGGGAGG,n/a
human,51275,MAPKAPK5-AS1,NR_152608.1,TRCN0000116227,NM_024930.1-2895s1c1,CCTCCCAAAGTTCTGGGATTA,pLKO.1,317,3UTR,95,95,,,Y,79993,ELOVL7,CCGGCCTCCCAAAGTTCTGGGATTACTCGAGTAATCCCAGAACTTTGGGAGGTTTTTG,AATTCAAAAACCTCCCAAAGTTCTGGGATTACTCGAGTAATCCCAGAACTTTGGGAGG,n/a
human,51275,MAPKAPK5-AS1,NR_152608.1,TRCN0000164591,NM_003281.3-2102s1c1,CCTCCCAAAGTTCTGGGATTA,pLKO.1,317,3UTR,95,95,,,Y,7135,TNNI1,CCGGCCTCCCAAAGTTCTGGGATTACTCGAGTAATCCCAGAACTTTGGGAGGTTTTTG,AATTCAAAAACCTCCCAAAGTTCTGGGATTACTCGAGTAATCCCAGAACTTTGGGAGG,n/a
human,51275,MAPKAPK5-AS1,NR_152608.1,TRCN0000163829,NM_173639.1-1102s1c1,CCTCCCAAATTACTGGGATTA,pLKO.1,317,3UTR,95,95,,,Y,284618,RUSC1-AS1,CCGGCCTCCCAAATTACTGGGATTACTCGAGTAATCCCAGTAATTTGGGAGGTTTTTG,AATTCAAAAACCTCCCAAATTACTGGGATTACTCGAGTAATCCCAGTAATTTGGGAGG,n/a
human,51275,MAPKAPK5-AS1,NR_152608.1,TRCN0000140374,NM_025042.2-1098s1c1,GCTTCCCAAAGTACTGGGATT,pLKO.1,316,3UTR,95,95,,,Y,,,CCGGGCTTCCCAAAGTACTGGGATTCTCGAGAATCCCAGTACTTTGGGAAGCTTTTTG,AATTCAAAAAGCTTCCCAAAGTACTGGGATTCTCGAGAATCCCAGTACTTTGGGAAGC,n/a
human,51275,MAPKAPK5-AS1,NR_152608.1,TRCN0000091448,NM_013513.1-2495s1c1,CCTCCCAAGTACTGGGATTAA,pLKO.1,317,3UTR,90,95,,,Y,13828,Epb42,CCGGCCTCCCAAGTACTGGGATTAACTCGAGTTAATCCCAGTACTTGGGAGGTTTTTG,AATTCAAAAACCTCCCAAGTACTGGGATTAACTCGAGTTAATCCCAGTACTTGGGAGG,n/a
human,51275,MAPKAPK5-AS1,NR_152608.1,TRCN0000155836,NM_198582.1-3275s1c1,CCCAAAGTGCTGGGATTACAA,pLKO.1,320,3UTR,90,95,,,Y,377007,KLHL30,CCGGCCCAAAGTGCTGGGATTACAACTCGAGTTGTAATCCCAGCACTTTGGGTTTTTG,AATTCAAAAACCCAAAGTGCTGGGATTACAACTCGAGTTGTAATCCCAGCACTTTGGG,n/a
human,51275,MAPKAPK5-AS1,NR_152608.1,TRCN0000141025,NM_152361.1-835s1c1,CCCAAAGTGCTGGGATTACTT,pLKO.1,320,3UTR,85,95,,,Y,126272,EID2B,CCGGCCCAAAGTGCTGGGATTACTTCTCGAGAAGTAATCCCAGCACTTTGGGTTTTTG,AATTCAAAAACCCAAAGTGCTGGGATTACTTCTCGAGAAGTAATCCCAGCACTTTGGG,n/a
human,51275,MAPKAPK5-AS1,NR_152608.1,TRCN0000072476,NM_198216.1-419s1c1,CCTCCCAAAGATACTGGTATT,pLKO.1,317,3UTR,90,89,,,Y,6628,SNRPB,CCGGCCTCCCAAAGATACTGGTATTCTCGAGAATACCAGTATCTTTGGGAGGTTTTTG,AATTCAAAAACCTCCCAAAGATACTGGTATTCTCGAGAATACCAGTATCTTTGGGAGG,n/a
human,51275,MAPKAPK5-AS1,NR_152608.1,TRCN0000286839,NM_198216.1-419s21c1,CCTCCCAAAGATACTGGTATT,pLKO_005,317,3UTR,90,89,,,Y,6628,SNRPB,CCGGCCTCCCAAAGATACTGGTATTCTCGAGAATACCAGTATCTTTGGGAGGTTTTTG,AATTCAAAAACCTCCCAAAGATACTGGTATTCTCGAGAATACCAGTATCTTTGGGAGG,n/a
human,51275,MAPKAPK5-AS1,NR_152608.1,TRCN0000172468,NM_178520.2-2286s1c1,CCTCTCAAAGCACTGGGATTA,pLKO.1,317,3UTR,90,89,,,Y,284186,TMEM105,CCGGCCTCTCAAAGCACTGGGATTACTCGAGTAATCCCAGTGCTTTGAGAGGTTTTTG,AATTCAAAAACCTCTCAAAGCACTGGGATTACTCGAGTAATCCCAGTGCTTTGAGAGG,n/a
human,51275,MAPKAPK5-AS1,NR_152608.1,TRCN0000204533,NM_001013675.1-1987s1c1,CCTCCCAAAGTGCTGGAATTA,pLKO.1,317,3UTR,90,89,,,Y,400891,LRRC74B,CCGGCCTCCCAAAGTGCTGGAATTACTCGAGTAATTCCAGCACTTTGGGAGGTTTTTG,AATTCAAAAACCTCCCAAAGTGCTGGAATTACTCGAGTAATTCCAGCACTTTGGGAGG,n/a
human,51275,MAPKAPK5-AS1,NR_152608.1,TRCN0000072628,NM_016065.3-1636s1c1,CCTCCCAAAGTGCTAGGATTA,pLKO.1,317,3UTR,90,89,,,Y,51021,MRPS16,CCGGCCTCCCAAAGTGCTAGGATTACTCGAGTAATCCTAGCACTTTGGGAGGTTTTTG,AATTCAAAAACCTCCCAAAGTGCTAGGATTACTCGAGTAATCCTAGCACTTTGGGAGG,n/a
human,51275,MAPKAPK5-AS1,NR_152608.1,TRCN0000008902,NM_016540.2-2291s1c1,CCTCCCAAAGTGTTGGGATTA,pLKO.1,317,3UTR,90,89,,,Y,10888,GPR83,CCGGCCTCCCAAAGTGTTGGGATTACTCGAGTAATCCCAACACTTTGGGAGGTTTTTG,AATTCAAAAACCTCCCAAAGTGTTGGGATTACTCGAGTAATCCCAACACTTTGGGAGG,n/a
human,51275,MAPKAPK5-AS1,NR_152608.1,TRCN0000156315,NM_020702.1-3633s1c1,CCTCCCAAAGTGTTGGGATTA,pLKO.1,317,3UTR,90,89,,,Y,57462,MYORG,CCGGCCTCCCAAAGTGTTGGGATTACTCGAGTAATCCCAACACTTTGGGAGGTTTTTG,AATTCAAAAACCTCCCAAAGTGTTGGGATTACTCGAGTAATCCCAACACTTTGGGAGG,n/a
human,51275,MAPKAPK5-AS1,NR_152608.1,TRCN0000040213,NM_000618.2-6169s1c1,CCTCCCAAATTGCTGGGATTA,pLKO.1,317,3UTR,90,89,,,Y,3479,IGF1,CCGGCCTCCCAAATTGCTGGGATTACTCGAGTAATCCCAGCAATTTGGGAGGTTTTTG,AATTCAAAAACCTCCCAAATTGCTGGGATTACTCGAGTAATCCCAGCAATTTGGGAGG,n/a
human,51275,MAPKAPK5-AS1,NR_152608.1,TRCN0000010150,NM_004197.x-992s1c1,GCCTGGAGCTGGGAGATTCAT,pLKO.1,852,3UTR,85,89,,,Y,8859,STK19,CCGGGCCTGGAGCTGGGAGATTCATCTCGAGATGAATCTCCCAGCTCCAGGCTTTTTG,AATTCAAAAAGCCTGGAGCTGGGAGATTCATCTCGAGATGAATCTCCCAGCTCCAGGC,n/a
human,51275,MAPKAPK5-AS1,NR_152608.1,TRCN0000162795,NM_017842.1-1079s1c1,CTTCCAAAGTGCTGGGATTAT,pLKO.1,318,3UTR,85,89,,,Y,55652,SLC48A1,CCGGCTTCCAAAGTGCTGGGATTATCTCGAGATAATCCCAGCACTTTGGAAGTTTTTG,AATTCAAAAACTTCCAAAGTGCTGGGATTATCTCGAGATAATCCCAGCACTTTGGAAG,n/a
human,51275,MAPKAPK5-AS1,NR_152608.1,TRCN0000140657,NM_012099.1-2957s1c1,CCTCCCAAAGTGCTAGGATAA,pLKO.1,317,3UTR,85,89,,,Y,10849,CD3EAP,CCGGCCTCCCAAAGTGCTAGGATAACTCGAGTTATCCTAGCACTTTGGGAGGTTTTTG,AATTCAAAAACCTCCCAAAGTGCTAGGATAACTCGAGTTATCCTAGCACTTTGGGAGG,n/a
human,51275,MAPKAPK5-AS1,NR_152608.1,TRCN0000197431,NM_001005424.1-3156s1c1,CCTCCTTTAGTCTTATACAAA,pLKO.1,207,3UTR,85,89,,,Y,381353,Gm996,CCGGCCTCCTTTAGTCTTATACAAACTCGAGTTTGTATAAGACTAAAGGAGGTTTTTG,AATTCAAAAACCTCCTTTAGTCTTATACAAACTCGAGTTTGTATAAGACTAAAGGAGG,n/a
human,51275,MAPKAPK5-AS1,NR_152608.1,TRCN0000109287,NM_013670.2-517s1c1,CCTGCAAGATGGGAGAATCTT,pLKO.1,853,3UTR,85,89,,,Y,20646,Snrpn,CCGGCCTGCAAGATGGGAGAATCTTCTCGAGAAGATTCTCCCATCTTGCAGGTTTTTG,AATTCAAAAACCTGCAAGATGGGAGAATCTTCTCGAGAAGATTCTCCCATCTTGCAGG,n/a
human,51275,MAPKAPK5-AS1,NR_152608.1,TRCN0000366155,NM_018783.4-625s21c1,GAGGACTTCCCGAAGGATTTA,pLKO_005,403,3UTR,80,89,,,Y,54723,Tfip11,CCGGGAGGACTTCCCGAAGGATTTACTCGAGTAAATCCTTCGGGAAGTCCTCTTTTTG,AATTCAAAAAGAGGACTTCCCGAAGGATTTACTCGAGTAAATCCTTCGGGAAGTCCTC,n/a
human,51275,MAPKAPK5-AS1,NR_152608.1,TRCN0000248892,NM_008631.2-75s21c1,GATCTGCATCTGCGGAGATAA,pLKO_005,7,3UTR,77,85,,,Y,17752,Mt4,CCGGGATCTGCATCTGCGGAGATAACTCGAGTTATCTCCGCAGATGCAGATCTTTTTG,AATTCAAAAAGATCTGCATCTGCGGAGATAACTCGAGTTATCTCCGCAGATGCAGATC,n/a
human,51275,MAPKAPK5-AS1,NR_152608.1,TRCN0000204482,NM_146490.1-232s1c1,CTCTGTTACTCCTCTGCCATT,pLKO.1,793,3UTR,77,85,,,Y,258483,Olfr1411,CCGGCTCTGTTACTCCTCTGCCATTCTCGAGAATGGCAGAGGAGTAACAGAGTTTTTG,AATTCAAAAACTCTGTTACTCCTCTGCCATTCTCGAGAATGGCAGAGGAGTAACAGAG,n/a
